program: Gaussian 09
title: 000260532
version: EM64L-G09RevD.01
frameworkgroup: C1[X(C9H9N3OS2)]
method: RPBEPBE
basis: SDD
operation: Freq
keyword: #p
keyword: freq=noraman
keyword: PBEPBE/SDD
title: #p freq=noraman PBEPBE/SDD
converged: NO YES NO NO
title: Mulliken charges:
elementType: S S O N N N C C C C C C C C C H H H H H H H H H
charge: 0.309309 0.317265 -0.263400 -0.064491 -0.356322 -0.511233 -0.351964 0.420040 -0.495625 -0.274909 -0.339535 -0.236427 -0.204192 -0.763421 0.244993 0.249408 0.256896 0.295609 0.297931 0.235259 0.235415 0.394074 0.300323 0.304997
chargesum: 0.00000
title: Mulliken charges with hydrogens summed into heavy atoms:
elementType: S S O N N N C C C C C C C C C
charge: 0.309309 0.317265 -0.263400 -0.064491 0.037752 0.094087 -0.351964 0.420040 -0.495625 -0.025501 -0.082639 -0.001168 0.031223 -0.169882 0.244993
polarizability: 2.35840412e+02 2.15931943e+01 1.65419916e+02 -9.18651783e+00 1.20501168e+01 7.84909687e+01
1716.lowfreq: -32.1542 -9.8345 -6.2203 0.0004 0.0019 0.0023 1.8242 33.5994 49.3371
frequency: -32.0816 33.5333 49.2696 70.8240 104.6724 124.9198 139.0055 188.3893 209.7853 245.4889 285.4457 290.9194 347.7169 381.7188 392.7598 428.4041 486.7242 508.8837 538.3858 579.0085 580.4991 626.3064 665.5835 679.1963 728.6550 730.9918 764.9907 771.5671 833.9498 837.6022 862.8730 874.8639 928.1957 944.7877 946.8223 986.2722 1017.8311 1041.2721 1116.1125 1121.5676 1170.7051 1181.5644 1224.4649 1240.9824 1272.2340 1276.4771 1289.4692 1378.2413 1410.3548 1430.3111 1443.5920 1455.1193 1510.6810 1571.2317 1600.0608 1626.5720 1674.7233 3049.8388 3140.2776 3142.3973 3153.3911 3166.6120 3177.0772 3272.0616 3387.5442 3502.4498
redmass: 2.1622 4.7610 4.4457 4.2692 5.4617 4.6160 3.0834 5.9672 5.5553 3.6055 5.6627 6.2602 9.0804 8.1179 3.0024 3.1282 8.7865 6.2804 7.3920 5.0242 8.2627 8.5758 5.6585 7.2842 3.7469 3.5270 1.5046 1.7509 1.2535 5.0583 1.3800 1.9108 9.1748 4.6968 1.3916 1.3243 2.2236 5.5118 1.6601 1.5334 1.1242 1.8126 2.7633 1.2178 1.6610 1.4833 1.7206 5.4412 1.1568 2.7021 2.5420 8.0341 1.4985 6.3901 7.0604 5.8464 1.0693 1.0586 1.0859 1.1067 1.0903 1.0956 1.1004 1.0878 1.0429 1.0984
irintensity: 32.7127 3.4254 3.3383 2.0411 0.5144 3.2276 8.0875 3.1680 3.0882 20.0335 13.6044 3.5824 3.0888 5.6028 10.5309 7.7339 0.2751 3.6542 10.7778 4.4869 0.8170 22.1173 2.1328 3.4127 12.9688 15.9706 78.5995 95.6184 104.6690 8.2814 2.4141 23.8773 134.5280 26.2594 2.5955 0.0339 5.1517 11.0313 6.0689 6.2778 0.1284 22.9761 5.6563 13.3560 3.4204 5.6471 8.2159 10.2740 26.3441 63.6122 15.4497 114.3856 81.2360 1.6755 2.2078 305.9077 4.3600 5.6054 1.3357 0.2151 7.3218 13.5385 16.0602 439.6085 4.1582 1.6310
temp: 298.150 k
press: 1.00000 atm
elementType: 16 16 8 7 7 7 6 6 6 6 6 6 6 6 6 1 1 1 1 1 1 1 1 1
symmnumber: 1
zpe: 449881.0 jmol-1
zpe.correction: 0.171351 hartree
zpe.thermalcorrener: 0.185004 hartree
zpe.thermalcorrenthalpy: 0.185948 hartree
zpe.thermalcorrgfe: 0.129427 hartree
zpe.sumelectzpe: -1382.859852 hartree
zpe.sumelectthermal: -1382.846199 hartree
zpe.sumelectthermalent: -1382.845255 hartree
zpe.sumelectthermalfe: -1382.901776 hartree
dipole: 4.0969 0.7598 1.1873
dipole: 4.3326
quadrupole: -104.2455 -96.5900 -101.9532
quadrupole: -0.0140 -3.9726 1.8168
quadrupole: -3.3160 4.3396 -1.0236 -0.0140 -3.9726 1.8168
hfenergy: -1383.0312027 hartree
pointgroup: C01 [X(C9H9N3O1S2)]
dipole: 1.627952 0.4923914 0.1135737 debye
dipolederiv: -0.5310396 0.0656267 0.102387 0.116295 -0.2093695 0.0888293 0.1714164 0.0706238 0.0709394 -0.7165056 -0.0228888 0.1177672 -0.0387189 -0.0183465 0.1053705 0.1060045 0.0268105 -0.0884531 -1.1619613 -0.1307439 0.1565615 -0.0452167 -0.389773 0.0832121 -0.2655059 0.0726168 -0.4511983 -0.8193325 -0.0784706 0.1170691 -0.2152368 -0.9013975 0.2850245 0.03452 0.231996 -0.2553633 -0.6166292 -0.1698306 0.2605143 -0.1424696 -0.48625 0.0601848 0.1655014 0.0408262 -0.3285116 -0.2829145 -0.0769486 0.1662268 -0.0550518 -0.0893591 0.0958621 0.0294408 0.1275221 -0.245948 -0.0548479 0.2600462 -0.0963822 0.4083167 0.213824 -0.1667617 -0.118316 -0.1354449 -0.022693 0.4368961 0.2249468 -0.1169203 0.0428785 0.0261543 0.0234469 -0.0936564 -0.0366227 0.0913107 1.3390268 -0.1135904 -0.2576338 0.0752238 0.6965997 -0.3033376 -0.3332302 -0.1983083 0.0104023 0.0539875 -0.1107673 -0.0094804 -0.1762597 -0.0415822 0.0233898 0.0068102 0.0037102 -0.1171502 0.0230561 -0.0682535 -0.0227613 -0.0477441 0.0243543 -0.0343033 -0.0212791 -0.0359926 -0.1274561 0.0098838 -0.0455365 -0.0327614 -0.0732323 -0.0119524 -0.0268698 -0.0243663 -0.0311362 -0.1448791 -0.1378521 0.0434077 -0.0205429 0.086366 0.0874273 -0.0851882 -0.0276981 -0.0768549 -0.1269821 0.120088 -0.1043666 -0.0792127 -0.1845405 0.1025143 0.1395154 -0.1205655 0.1399156 -0.0505515 1.415573 0.3112933 -0.2441957 0.2401102 0.3582036 -0.370113 0.2370507 -0.4029424 0.5748379 0.0439325 0.0485256 0.0163032 0.0985867 0.0012668 0.0207833 0.0052821 0.0344834 0.1568651 0.0393014 0.0930751 0.0071463 0.0583678 0.016333 0.0268882 0.0149239 0.0221372 0.155193 0.0072935 0.0055221 0.0770915 0.0745852 0.0754925 0.0343875 0.0129572 0.0367202 0.0503878 0.019605 -0.0201126 -0.0811581 0.0105907 -0.0263298 -0.0643324 -0.0540059 0.014036 0.0752184 -0.1014436 -0.0172264 0.067573 -0.0271148 0.0884507 0.0266749 0.0711536 0.0252966 0.1418268 0.0543629 -0.0613193 0.0404726 -0.0752569 -0.0592281 0.0758893 0.045443 0.0750659 0.1320947 0.630485 -0.1780364 0.0917754 -0.1365205 0.3026844 0.0302943 0.155748 0.0389268 0.1508879 0.1014412 0.1974073 -0.0869972 0.0643848 0.1689191 -0.0540815 0.0212546 -0.0776292 0.1376769 0.1275936 -0.0517594 -0.1728417 -0.0583427 0.0713642 -0.0147652 -0.0188831 0.0342438 0.2115457 unknown
polarizability: 231.6275612|11.0940643|153.6137703|-30.9414508|-33.1319575|94.5099647 unknown
InChI: InChI=1S/C9H9N3OS2/c10-12-8(13)5-14-9-11-6-3-1-2-4-7(6)15-9/h1-4,12H,5,10H2
charge 0 multiplicity 1
24 atoms
S  1.26672 -2.181497 0.641872
S  -1.773336 -1.844736 1.253299
O  -4.776907 0.104632 0.171285
N  -0.053447 0.143848 0.317163
N  -2.713838 0.96234 -0.523618
N  -3.19445 1.486468 -1.756798
C  2.164775 -0.722889 0.027732
C  1.284237 0.402875 -0.058975
C  -0.233034 -1.106585 0.697156
C  3.522372 -0.628746 -0.329805
C  1.778531 1.647247 -0.513567
C  4.002101 0.623469 -0.778836
C  3.138328 1.747439 -0.869616
C  -2.803122 -0.269728 1.585079
C  -3.531509 0.26924 0.348131
H  4.193171 -1.49048 -0.264496
H  1.102467 2.504305 -0.585039
H  -3.54985 -0.593589 2.324699
H  -2.11025 0.465905 2.024235
H  5.055324 0.723649 -1.061058
H  3.534506 2.704711 -1.223973
H  -1.687419 0.952556 -0.376282
H  -3.779485 2.317554 -1.58834
H  -3.738687 0.769213 -2.259049
