program: Gaussian 09
title: 000260540
version: EM64L-G09RevD.01
frameworkgroup: C1[X(C13H17N3O4)]
method: RPBEPBE
basis: SDD
operation: Freq
keyword: #p
keyword: freq=noraman
keyword: PBEPBE/SDD
title: #p freq=noraman PBEPBE/SDD
converged: YES YES NO NO
title: Mulliken charges:
elementType: O O O O N N N C C C C C C C C C C C C C H H H H H H H H H H H H H H H H H
charge: -0.267630 -0.217864 -0.309393 -0.225537 -0.422049 0.024142 -0.102714 0.048348 0.050012 0.262678 -0.416752 0.140600 -0.042808 0.145006 -0.214975 -0.216332 -0.213525 -0.677732 -0.679791 -0.674880 0.352676 0.290795 0.226960 0.226963 0.214325 0.214317 0.232924 0.232915 0.213841 0.230391 0.230391 0.202790 0.233213 0.233211 0.217189 0.229145 0.229150
chargesum: 0.00000
title: Mulliken charges with hydrogens summed into heavy atoms:
elementType: O O O O N N N C C C C C C C C C C C C C
charge: -0.267630 -0.217864 -0.309393 -0.225537 -0.069373 0.024142 -0.102714 0.048348 0.050012 0.262678 -0.125957 0.140600 -0.042808 0.145006 0.238948 0.212310 0.252314 -0.003109 -0.010577 0.000605
polarizability: 2.99647687e+02 8.18443812e+00 1.98480597e+02 -1.35146989e-03 -1.23911039e-04 9.76704390e+01
1716.lowfreq: -7.3202 -5.2687 -2.4328 -0.0009 0.0004 0.0009 17.3848 37.9896 49.8718
frequency: 16.8097 37.9851 49.8545 54.9653 68.4576 72.6821 81.5987 85.6872 107.3338 128.4173 132.4541 170.9282 205.1151 221.9295 242.7134 246.9495 253.0915 253.5980 275.3119 281.0836 303.1886 327.9137 357.7508 386.9225 431.5090 469.6139 545.0642 566.2866 591.9680 621.1028 643.4056 649.4734 695.1933 704.8145 726.2538 751.7533 772.8360 798.8837 800.8791 801.7259 807.0080 831.3285 836.5274 855.4709 864.8551 950.3554 987.3512 1016.5557 1025.4561 1038.1888 1060.9531 1086.8942 1111.8360 1114.2873 1115.6126 1134.3189 1135.7285 1136.4895 1184.3943 1209.5166 1245.4904 1248.4721 1250.2110 1264.0493 1279.7997 1332.7670 1340.0680 1358.1843 1373.1850 1381.5019 1399.0231 1400.2299 1401.0244 1405.4455 1436.4357 1460.0207 1463.3459 1464.8964 1471.9330 1474.4737 1475.0241 1485.7422 1486.9132 1489.5281 1508.8567 1537.4341 1610.1376 1649.6085 2994.2544 2995.7672 2996.4424 2998.6174 3010.4742 3011.6093 3055.8499 3069.5711 3069.8961 3092.5914 3092.9661 3093.4772 3106.7244 3108.0858 3108.5974 3250.4864 3606.0740
redmass: 2.8561 3.1685 3.0678 4.0256 3.5486 2.9353 1.7848 3.4594 3.0198 4.1693 3.5148 3.8967 4.8026 2.5105 1.2165 1.4496 1.6978 5.0913 4.7091 5.4009 3.2802 4.0721 3.5418 10.4388 6.4178 5.5291 5.0245 7.9294 8.4262 1.7840 2.0746 5.6961 8.1669 8.1295 5.0482 8.2158 9.0831 1.1021 5.5044 1.0951 1.0923 3.8019 3.4823 1.5651 4.1375 6.6906 3.1719 2.2963 2.3119 3.2466 3.4086 6.4771 2.2182 2.2721 2.4126 1.4430 1.4465 1.4659 1.9928 3.1067 1.1391 1.1423 1.1324 2.4280 8.0979 2.0187 1.8950 1.4412 2.8224 3.0881 1.3300 1.4469 1.2951 4.0632 4.6345 1.0400 1.0403 1.0403 1.1016 1.0598 1.0694 1.1298 1.0744 1.0891 5.9589 5.6700 10.4281 11.8954 1.0448 1.0358 1.0358 1.0484 1.0580 1.0582 1.1070 1.1067 1.1065 1.0985 1.0985 1.0985 1.1029 1.1027 1.1019 1.0991 1.0813
irintensity: 0.2077 2.7015 0.6461 0.5160 0.0000 0.0398 0.3522 0.0019 1.6587 0.8157 4.3309 5.5937 8.2844 0.2686 0.3590 0.2304 3.5275 0.7259 0.9082 3.1067 1.2778 13.0032 6.2087 0.0378 4.6029 2.1765 2.4146 12.3134 9.9880 24.4498 52.7247 22.6608 14.4992 6.4500 22.1401 5.2875 1.6404 2.9114 3.0686 2.7369 5.9461 1.5020 22.9968 38.3819 46.1340 93.6475 8.6813 47.3005 38.6350 184.5323 116.8624 202.2157 8.2686 1.2760 44.4264 0.8479 7.8812 6.0302 120.0538 737.7610 0.0184 0.0028 0.0048 97.0373 214.0798 168.0637 138.4443 8.7751 56.2464 57.9814 31.8476 86.0691 2.3690 16.8552 262.2562 10.9419 12.1846 13.2574 19.2958 8.3769 9.8924 43.8072 10.1115 7.4387 286.1244 38.0579 490.1209 129.6295 28.3234 18.1259 20.7848 33.1217 23.4763 20.3356 18.4566 7.1095 6.4726 36.3249 23.9439 30.7504 41.6602 30.5351 56.9362 1.8727 110.1312
temp: 298.150 k
press: 1.00000 atm
elementType: 8 8 8 8 7 7 7 6 6 6 6 6 6 6 6 6 6 6 6 6 1 1 1 1 1 1 1 1 1 1 1 1 1 1 1 1 1
symmnumber: 1
zpe: 764365.4 jmol-1
zpe.correction: 0.291131 hartree
zpe.thermalcorrener: 0.311785 hartree
zpe.thermalcorrenthalpy: 0.312729 hartree
zpe.thermalcorrgfe: 0.239381 hartree
zpe.sumelectzpe: -969.241560 hartree
zpe.sumelectthermal: -969.220906 hartree
zpe.sumelectthermalent: -969.219962 hartree
zpe.sumelectthermalfe: -969.293310 hartree
dipole: -0.4166 7.2023 0.0002
dipole: 7.2143
quadrupole: -92.1716 -122.8311 -116.8633
quadrupole: 0.0528 0.0017 0.0005
quadrupole: 18.4504 -12.2091 -6.2413 0.0528 0.0017 0.0005
hfenergy: -969.5326909 hartree
pointgroup: C01 [X(C13H17N3O4)]
dipole: 0.079205 2.8372142 0.0038945 debye
polarizability: 300.0461349|-5.1493955|198.0819483|0.0272503|0.139649|97.6706391 unknown
InChI: InChI=1S/C13H17N3O4/c1-4-18-11-10-8(15-13(16-11)20-6-3)7-9(14-10)12(17)19-5-2/h7,14H,4-6H2,1-3H3
charge 0 multiplicity 1
37 atoms
O  -0.981172 2.267659 0.000989
O  -3.780992 -1.565741 -0.004741
O  4.026546 0.25897 -0.000866
O  4.135515 -2.085881 -0.004314
N  1.333271 0.298659 -0.001273
N  -1.504176 -1.925332 -0.004856
N  -2.404681 0.35805 -0.001826
C  -0.03078 0.06128 -0.001838
C  -0.246221 -1.364922 -0.003873
C  1.994079 -0.938414 -0.002901
C  1.050645 -1.980316 -0.00454
C  -1.170802 0.899333 -0.000891
C  -2.507361 -1.024202 -0.003706
C  3.459556 -1.03016 -0.002778
C  -2.204972 3.125688 0.001967
C  -4.934403 -0.627002 -0.003886
C  5.519862 0.31273 -0.000702
C  -1.717359 4.570339 0.004103
C  -6.186471 -1.499507 -0.005038
C  5.911879 1.786377 0.001862
H  1.806337 1.200961 0.000065
H  1.27944 -3.042623 -0.006001
H  -2.803402 2.879043 -0.893566
H  -2.803759 2.876505 0.896559
H  -4.873393 0.018491 0.892013
H  -4.873104 0.020449 -0.898355
H  5.884263 -0.225083 0.893092
H  5.884334 -0.2220 -0.896316
H  -2.584232 5.255915 0.004804
H  -1.108469 4.78037 0.899993
H  -1.107973 4.782834 -0.89087
H  -7.089553 -0.8617 -0.004412
H  -6.213059 -2.144473 -0.899692
H  -6.213256 -2.146496 0.888149
H  7.013242 1.877907 0.002004
H  5.522995 2.301362 -0.89328
H  5.523026 2.298229 0.898813
