program: Gaussian 09
title: 000260517
version: EM64L-G09RevD.01
frameworkgroup: C1[X(C14H16O8)]
method: RPBEPBE
basis: SDD
operation: Freq
keyword: #pfreq=noraman
keyword: PBEPBE/SDD
title: #p freq=noraman PBEPBE/SDD
converged: YES YES NO NO
title: Mulliken charges:
elementType: O O O O O O O O C C C C C C C C C C C C C C H H H H H H H H H H H H H H H H
charge: -0.325464 -0.325460 -0.338608 -0.338615 -0.148462 -0.148461 -0.169279 -0.169295 -0.478150 -0.478049 -0.346129 -0.346089 0.176531 0.176536 0.015597 0.015569 0.071072 0.070998 0.240513 0.240438 -0.681442 -0.681461 0.262273 0.241379 0.241302 0.262355 0.210844 0.232049 0.232046 0.210830 0.226988 0.213828 0.209224 0.226983 0.209221 0.213833 0.387275 0.387282
chargesum: 0.00000
title: Mulliken charges with hydrogens summed into heavy atoms:
elementType: O O O O O O O O C C C C C C C C C C C C C C
charge: -0.325464 -0.325460 0.048667 0.048667 -0.148462 -0.148461 -0.169279 -0.169295 0.025502 0.025607 0.096764 0.096787 0.176531 0.176536 0.015597 0.015569 0.071072 0.070998 0.240513 0.240438 -0.031402 -0.031424
polarizability: 2.70072173e+02 -2.44770092e+01 1.82050054e+02 9.81267824e+00 -1.70772763e+00 1.21068225e+02
1716.lowfreq: -4.5928 -0.0012 -0.0010 -0.0003 1.6945 8.3924 13.1927 24.2525 24.6228
frequency: 13.1903 23.9720 24.6206 46.2418 51.3415 56.2827 60.1681 83.9688 93.1823 95.5226 106.8125 114.0325 131.9455 149.5541 167.3216 226.5392 234.3061 235.2247 239.7243 262.9591 288.6735 309.8599 312.4019 321.5122 345.4980 346.6886 354.0073 397.4051 397.6740 446.1336 475.9241 513.3157 525.7709 544.3064 560.3448 568.9512 572.1747 623.6571 661.6550 687.1791 737.0837 737.7923 755.1307 766.7496 798.5708 809.0779 846.0661 865.4842 866.5082 890.6636 898.1273 937.3223 989.7009 1021.9078 1023.2382 1042.7422 1059.4923 1061.5763 1100.3109 1100.4753 1118.5816 1120.5123 1148.9626 1184.5808 1219.8413 1219.9328 1255.2832 1280.1031 1282.0882 1287.2169 1295.9239 1296.8378 1359.9906 1360.2011 1378.5423 1383.6149 1395.5685 1395.6155 1435.0012 1435.0402 1474.8292 1474.8494 1479.9467 1479.9924 1486.5962 1486.6081 1556.0022 1562.3620 1590.0781 1639.0048 1708.9583 1709.2917 2977.4202 2977.4556 2985.0038 2985.0294 3001.8898 3001.9016 3036.9880 3036.9957 3055.7523 3055.7583 3080.2635 3080.2876 3081.7220 3081.7343 3494.3466 3494.6293
redmass: 3.8675 4.2648 4.5669 2.2580 1.8347 6.1761 3.7667 7.5342 2.9617 3.3713 8.0784 7.1561 6.6888 5.8390 6.2524 3.9995 1.1147 1.1458 5.4078 6.7136 6.4172 6.1448 9.7820 8.5917 3.6847 4.2756 8.5465 5.9131 9.4530 4.0463 9.8542 2.5612 3.0233 2.3496 4.1455 1.6428 1.9250 10.9642 7.6398 7.3818 1.1907 1.2104 9.6983 5.5802 7.0024 7.5642 8.0972 1.3366 1.3910 2.2073 1.9859 4.6664 6.4291 3.1406 2.7933 6.3489 2.9550 3.3464 1.5831 1.5863 2.1979 2.1827 2.7713 2.3926 1.3330 1.3316 3.3686 1.3541 1.1962 3.2743 1.3641 1.3571 1.6474 1.6508 3.1569 3.3930 1.2121 1.2124 1.0813 1.0815 1.0511 1.0511 1.0422 1.0422 1.0795 1.0794 11.9591 12.8106 11.2170 10.9090 11.1233 11.1375 1.0363 1.0363 1.0636 1.0636 1.0613 1.0613 1.0960 1.0960 1.0995 1.0994 1.1017 1.1017 1.0990 1.0990 1.0646 1.0645
irintensity: 0.5025 0.0060 0.8050 3.4402 0.0001 0.0000 1.5788 0.0000 4.0121 0.0007 2.1365 1.7328 0.0000 0.0000 1.9597 0.0000 0.7938 0.0124 6.7288 13.2315 0.0000 37.7630 0.0004 1.3220 0.0001 1.8685 0.0000 17.8728 0.0153 0.0000 0.0000 29.2796 0.0003 49.1255 0.0000 0.0009 228.6905 2.3048 0.0000 10.6988 0.0017 25.5388 6.5268 0.0000 256.4659 0.0001 0.0000 13.8627 0.0021 57.1435 0.0001 631.1113 31.9855 781.7972 0.0557 0.0000 75.3241 0.0000 0.2057 11.2268 119.2210 0.0002 0.0000 423.4417 0.2166 1.3298 0.0000 53.3783 0.0142 14.8959 52.2993 0.0273 57.9559 0.2963 28.0236 0.0000 11.3540 5.5674 43.3752 20.3819 9.5614 0.4071 12.8958 14.4216 3.6258 29.0422 0.0000 409.6495 243.0441 0.0000 0.0527 294.2047 70.2947 0.7178 12.5395 2.3361 18.8837 25.7146 1.1083 1.5042 0.4442 0.4890 0.1348 127.1173 85.6328 1.6323 0.0019 132.4107
temp: 298.150 k
press: 1.00000 atm
elementType: 8 8 8 8 8 8 8 8 6 6 6 6 6 6 6 6 6 6 6 6 6 6 1 1 1 1 1 1 1 1 1 1 1 1 1 1 1 1
symmnumber: 1
zpe: 741129.6 jmol-1
zpe.correction: 0.282281 hartree
zpe.thermalcorrener: 0.306075 hartree
zpe.thermalcorrenthalpy: 0.307019 hartree
zpe.thermalcorrgfe: 0.225370 hartree
zpe.sumelectzpe: -1143.189534 hartree
zpe.sumelectthermal: -1143.165741 hartree
zpe.sumelectthermalent: -1143.164797 hartree
zpe.sumelectthermalfe: -1143.246446 hartree
dipole: -0.0004 -0.0013 0.0004
dipole: 0.0014
quadrupole: -86.8036 -136.1380 -135.0362
quadrupole: 20.0009 10.5759 1.9446
quadrupole: 32.5223 -16.8121 -15.7102 20.0009 10.5759 1.9446
hfenergy: -1143.4718156 hartree
pointgroup: C01 [X(C14H16O8)]
dipole: -0.0001593 -0.0005076 0.000105 debye
polarizability: 269.4871711|-26.6315624|182.2753595|5.2319152|5.9061597|121.4279203 unknown
InChI: InChI=1S/C14H16O8/c1-3-5-7(15)21-13-9(17)11(19)14(12(20)10(13)18)22-8(16)6-4-2/h17,20H,3-6H2,1-2H3
charge 0 multiplicity 1
38 atoms
O  -2.725706 -0.517219 -0.63064
O  2.725225 0.502522 0.632878
O  -0.914696 -2.640428 -0.392379
O  0.914218 2.625724 0.394609
O  -1.733864 2.111374 -0.252224
O  1.733382 -2.126069 0.254489
O  -3.491501 0.198598 1.478939
O  3.491017 -0.214205 -1.4764
C  -5.081365 0.001466 -0.418919
C  5.080525 -0.01813 0.421879
C  -6.292011 0.037669 0.537726
C  6.291562 -0.056507 -0.534183
C  -1.37934 -0.266079 -0.267399
C  1.378895 0.251385 0.269501
C  -0.517938 -1.338325 -0.198984
C  0.517488 1.323628 0.201099
C  -0.943057 1.134083 -0.108323
C  0.942646 -1.14877 0.110256
C  -3.756846 -0.059561 0.300177
C  3.756459 0.04496 -0.297881
C  -7.619174 0.202526 -0.230677
C  7.618101 -0.223231 0.234895
H  -5.057313 0.917157 -1.045046
H  -5.144892 -0.843572 -1.129827
H  5.145067 0.826973 1.132613
H  5.054734 -0.933628 1.048228
H  -6.314823 -0.891872 1.13804
H  -6.160278 0.867355 1.256087
H  6.158871 -0.886181 -1.252381
H  6.316111 0.872831 -1.134742
H  -8.476766 0.226451 0.464956
H  -7.630491 1.144115 -0.811036
H  -7.783524 -0.631831 -0.938363
H  8.475982 -0.24868 -0.460327
H  7.783422 0.611058 0.942435
H  7.627675 -1.164681 0.815511
H  -1.886593 -2.661229 -0.609675
H  1.886096 2.646526 0.611988
