program: Gaussian 09
title: 000260510
version: EM64L-G09RevD.01
frameworkgroup: C1[X(C11H14BrN3O)]
method: RPBEPBE
basis: SDD
operation: Freq
keyword: #p
keyword: freq=noraman
keyword: PBEPBE/SDD
title: #p freq=noraman PBEPBE/SDD
converged: YES YES NO NO
title: Mulliken charges:
elementType: Br O N N N C C C C C C C C C C C H H H H H H H H H H H H H H
charge: -0.017228 -0.254650 0.028464 -0.415538 -0.650644 -0.505007 -0.542986 0.470456 0.194952 -0.339279 -0.401169 -0.815036 -0.196323 -0.242815 -0.212548 0.299202 0.209076 0.239550 0.250381 0.212605 0.248715 0.288477 0.250863 0.229632 0.246935 0.241039 0.250866 0.287829 0.344164 0.300015
chargesum: 0.00000
title: Mulliken charges with hydrogens summed into heavy atoms:
elementType: Br O N N N C C C C C C C C C C C
charge: -0.017228 -0.254650 0.028464 -0.127709 -0.006465 -0.056381 -0.080000 0.470456 0.194952 -0.090564 -0.112692 -0.087606 -0.196323 -0.001775 0.038318 0.299202
polarizability: 2.03367443e+02 -1.47762780e+01 1.65231906e+02 -1.46014482e+01 9.09376434e+00 1.14747356e+02
1716.lowfreq: -9.2309 -1.6510 -0.0008 -0.0008 -0.0007 2.9079 14.2182 20.3452 40.6295
frequency: 14.1185 20.2333 40.5959 49.5474 104.0910 111.0603 122.6880 140.9371 159.7210 190.2701 213.6936 247.5806 273.7293 281.0594 288.8187 343.7386 364.5008 426.9904 434.9887 452.4470 490.7742 501.5164 513.6611 551.4203 560.1955 586.1585 625.1547 652.0717 687.5466 710.8899 768.8883 779.5658 795.4006 868.5889 910.0147 921.7468 931.8940 945.9007 979.8472 991.1082 1000.1701 1020.7965 1032.8532 1046.3924 1068.9507 1095.6542 1119.0450 1180.6151 1192.2542 1202.9025 1217.6403 1272.2827 1294.1376 1300.3647 1328.3192 1346.6529 1373.4781 1386.1266 1418.9806 1450.9033 1453.1722 1463.9343 1469.3479 1477.8926 1502.0656 1566.4545 1601.4154 1605.3896 1611.1187 1681.6745 2954.0287 2963.0167 2980.4484 3009.5499 3025.3473 3067.2011 3095.9158 3139.9435 3142.3390 3166.1626 3176.3777 3419.7214 3537.6497 3695.1880
redmass: 6.7428 7.0369 4.4109 3.4975 6.0417 4.6150 1.5247 2.8000 4.0458 3.3876 3.1927 2.2030 2.8037 1.8002 5.6396 4.2114 2.5438 2.8192 2.9455 1.9182 1.6891 1.6740 2.8924 3.0056 3.1412 2.5306 4.3863 6.4834 2.6300 8.4671 2.0948 3.1517 1.8998 1.4864 1.5241 1.5873 2.6834 1.7922 4.1078 1.5193 1.7826 1.6272 3.5178 2.3186 2.2103 1.7555 2.3888 1.3813 1.1492 1.9445 1.2213 2.5432 2.1722 1.4674 1.5535 1.7507 4.4525 1.2327 2.3641 1.2112 1.1542 1.5281 1.3631 1.0594 1.5078 6.0962 1.3158 5.8405 5.7690 5.4101 1.0399 1.0607 1.0656 1.0997 1.0975 1.0951 1.0951 1.0921 1.0877 1.0928 1.0987 1.0749 1.0459 1.1035
irintensity: 2.1506 14.4349 7.0816 0.5807 4.9479 3.8632 2.3992 1.7332 2.4584 0.1847 1.2457 0.5990 4.5594 7.9266 6.6645 15.1211 8.3808 6.2395 3.9628 181.7038 122.2454 19.5935 7.8676 33.2131 19.3082 28.3896 11.9724 12.0460 22.5703 23.2051 33.1770 33.1988 30.5009 2.2884 8.4783 4.1407 2.7994 13.3760 13.4142 0.6842 9.7552 6.3901 9.8758 34.0802 12.1523 21.6059 82.9829 40.8138 7.2902 24.9973 2.5432 37.8435 269.9582 53.2486 10.0732 3.3340 3.6110 30.3342 16.5319 104.2123 81.5305 62.4492 9.8090 17.3671 182.3404 48.5873 126.1370 28.8078 3.6116 290.7149 16.4122 15.1063 54.4774 21.0561 21.3092 16.4651 15.3187 5.9889 4.3249 0.8820 6.7818 12.9805 45.5722 40.9681
temp: 298.150 k
press: 1.00000 atm
elementType: 35 8 7 7 7 6 6 6 6 6 6 6 6 6 6 6 1 1 1 1 1 1 1 1 1 1 1 1 1 1
symmnumber: 1
zpe: 617315.1 jmol-1
zpe.correction: 0.235123 hartree
zpe.thermalcorrener: 0.252055 hartree
zpe.thermalcorrenthalpy: 0.252999 hartree
zpe.thermalcorrgfe: 0.186931 hartree
zpe.sumelectzpe: -679.307077 hartree
zpe.sumelectthermal: -679.290144 hartree
zpe.sumelectthermalent: -679.289200 hartree
zpe.sumelectthermalfe: -679.355268 hartree
dipole: 3.2405 2.8283 4.7803
dipole: 6.4305
quadrupole: -103.1416 -93.7381 -101.4819
quadrupole: 2.0169 25.2978 -3.3087
quadrupole: -3.6878 5.7158 -2.0280 2.0169 25.2978 -3.3087
hfenergy: -679.5421995 hartree
pointgroup: C01 [X(C11H14Br1N3O1)]
dipole: 1.8792538 -0.8281073 -1.4776026 debye
polarizability: 179.3887875|-1.6481972|156.6965166|43.7483612|17.3493938|147.2614007 unknown
InChI: InChI=1S/C11H14BrN3O/c1-8(14-15-11(13)16)5-6-9-3-2-4-10(12)7-9/h2-4,7,15H,5-6,13H2,1H3
charge 0 multiplicity 1
30 atoms
Br -4.799588 1.227623 -2.576171
O  2.740028 1.133006 2.490558
N  1.717296 -0.889755 0.826645
N  2.80446 -0.104913 0.470959
N  4.444597 1.496685 0.939209
C  -1.26542 -2.297881 -0.411057
C  0.037582 -2.553331 0.394958
C  -1.849702 -0.886348 -0.339007
C  1.230833 -1.733694 -0.06028
C  -2.837291 -0.520871 -1.294438
C  -1.481919 0.056948 0.654012
C  1.772278 -1.920408 -1.469537
C  -3.432911 0.751691 -1.235111
C  -2.093855 1.330716 0.693474
C  -3.080613 1.696466 -0.250387
C  3.285986 0.858607 1.392863
H  -1.102724 -2.563012 -1.475228
H  -2.028165 -3.013795 -0.041057
H  -0.126243 -2.350879 1.467715
H  0.280072 -3.632022 0.302663
H  -3.135436 -1.231794 -2.073024
H  -0.703558 -0.181405 1.384218
H  1.247671 -2.738795 -1.987629
H  2.852559 -2.173296 -1.464656
H  1.643285 -1.004805 -2.082344
H  -1.795808 2.050677 1.46315
H  -3.553587 2.681969 -0.220689
H  3.22117 -0.161465 -0.467129
H  4.822282 2.22721 1.537123
H  4.973919 1.209469 0.118499
