program: Gaussian 09
title: 000260516
version: EM64L-G09RevD.01
frameworkgroup: C1[X(C14H12O10)]
method: RPBEPBE
basis: SDD
operation: Freq
keyword: #p
keyword: freq=noraman
keyword: PBEPBE/SDD
title: #p freq=noraman PBEPBE/SDD
converged: YES YES NO NO
title: Mulliken charges:
elementType: O O O O O O O O O O C C C C C C C C C C C C C C H H H H H H H H H H H H
charge: -0.260301 -0.260266 -0.260290 -0.260283 -0.154237 -0.154233 -0.173734 -0.173775 -0.173761 -0.173746 0.134818 0.134684 0.134685 0.134787 0.128609 0.128771 0.276841 0.276935 0.276840 0.276847 -0.741369 -0.741456 -0.741369 -0.741339 0.257228 0.268324 0.251038 0.257271 0.268264 0.251050 0.268322 0.257219 0.251039 0.268346 0.257203 0.251036
chargesum: 0.00000
title: Mulliken charges with hydrogens summed into heavy atoms:
elementType: O O O O O O O O O O C C C C C C C C C C C C C C
charge: -0.260301 -0.260266 -0.260290 -0.260283 -0.154237 -0.154233 -0.173734 -0.173775 -0.173761 -0.173746 0.134818 0.134684 0.134685 0.134787 0.128609 0.128771 0.276841 0.276935 0.276840 0.276847 0.035221 0.035129 0.035212 0.035246
polarizability: 2.05179189e+02 5.96546304e-03 2.62291981e+02 5.38454272e-03 -1.05138546e+01 1.32253889e+02
1716.lowfreq: -0.0008 -0.0007 0.0005 2.9471 3.8615 4.4489 31.7671 38.5279 44.4602
frequency: 31.7671 38.5279 44.4512 45.6137 53.1569 54.7398 55.1245 56.6360 62.8157 67.3514 85.0466 98.2051 99.0116 100.8033 102.1747 104.4582 140.4324 149.3350 167.2294 237.3750 243.3136 257.3199 264.5739 305.4280 320.7862 333.3505 341.3426 344.9370 369.5104 421.3500 431.3282 444.6309 464.5727 524.0497 527.5123 528.6464 534.4727 540.6540 547.5777 552.2397 621.3905 628.7195 655.5470 656.3806 720.8817 763.3464 764.3726 766.6522 781.8469 798.4539 881.4022 954.3530 973.4909 977.2220 980.1763 982.2300 1014.4704 1037.4821 1040.0016 1040.2124 1040.4059 1065.9128 1124.0655 1125.2759 1141.2723 1157.9973 1167.3009 1233.7273 1291.0850 1296.2190 1385.3940 1385.4565 1385.5445 1386.2735 1450.3214 1450.4290 1450.4406 1450.4522 1451.5861 1451.8207 1451.8689 1452.1180 1550.4520 1560.7249 1604.8793 1660.7153 1714.8382 1715.1123 1720.7284 1721.1608 3010.9773 3010.9814 3010.9863 3010.9912 3102.0261 3102.0364 3102.0423 3102.0658 3147.0945 3147.1201 3147.1306 3147.1870
redmass: 5.0923 8.1309 4.8612 5.3818 4.6822 4.9987 3.0857 3.6934 3.2907 4.1118 3.6240 1.3806 1.1370 1.1920 1.3554 4.1801 12.4040 10.0315 13.6777 4.7662 4.3063 6.2170 8.9461 5.6387 6.0285 10.6836 8.8916 5.4636 10.0690 4.4199 11.8272 7.2997 4.6913 5.9360 4.2651 3.2248 3.3425 3.3865 5.0303 5.5043 7.6908 9.2688 8.8446 6.4032 7.3102 7.3987 9.6623 8.5917 9.4916 11.0361 10.9921 6.8741 2.6060 2.4858 2.8060 2.1886 10.9056 1.6751 1.6470 1.6487 1.6437 8.3862 2.7410 2.5725 2.5784 2.8496 13.0080 8.7555 12.2231 10.3216 1.2356 1.2342 1.2311 1.2368 1.0478 1.0494 1.0498 1.0492 1.0518 1.0525 1.0512 1.0517 12.9748 12.9991 12.0037 12.0341 10.9518 10.8619 10.8686 11.0220 1.0374 1.0374 1.0374 1.0374 1.0958 1.0958 1.0958 1.0958 1.1020 1.1020 1.1020 1.1019
irintensity: 0.6955 0.8394 0.0002 6.3476 1.5721 0.0022 8.2237 0.0006 9.5230 0.0000 0.0000 0.0206 0.4645 0.2974 0.0029 0.0000 0.0785 0.9548 0.0000 0.0000 0.0000 4.4569 6.3826 27.3374 0.0000 0.0000 9.1718 3.4033 0.0000 23.2157 0.0000 0.0000 0.0000 0.0000 2.0020 0.0001 59.3573 0.0000 94.5473 7.4380 0.0000 66.9245 0.0011 65.7260 0.0001 0.0051 153.3121 28.2337 217.6356 0.0001 0.0000 349.3539 0.0003 502.2335 438.9135 0.0005 108.0002 0.0003 29.5097 22.6533 0.0886 0.0001 1572.6767 0.0048 411.7329 0.0001 0.0001 160.2001 0.6548 0.0000 0.8352 148.4464 124.7797 0.0069 0.1622 35.6343 11.0288 28.9476 8.0407 0.1075 0.0915 86.8824 0.0002 266.6479 229.3180 0.0000 0.0116 40.7270 0.0265 607.6205 0.0026 0.2012 0.0913 0.0188 2.8454 12.0688 0.8361 0.0654 0.1754 5.2308 26.2357 0.1026
temp: 298.150 k
press: 1.00000 atm
elementType: 8 8 8 8 8 8 8 8 8 8 6 6 6 6 6 6 6 6 6 6 6 6 6 6 1 1 1 1 1 1 1 1 1 1 1 1
symmnumber: 1
zpe: 635305.0 jmol-1
zpe.correction: 0.241975 hartree
zpe.thermalcorrener: 0.267959 hartree
zpe.thermalcorrenthalpy: 0.268904 hartree
zpe.thermalcorrgfe: 0.182458 hartree
zpe.sumelectzpe: -1291.133508 hartree
zpe.sumelectthermal: -1291.107523 hartree
zpe.sumelectthermalent: -1291.106579 hartree
zpe.sumelectthermalfe: -1291.193025 hartree
dipole: 0.0002 0.0014 0.0010
dipole: 0.0017
quadrupole: -92.4125 -131.3463 -148.6779
quadrupole: -0.0087 -0.0071 -19.7964
quadrupole: 31.7331 -7.2007 -24.5323 -0.0087 -0.0071 -19.7964
hfenergy: -1291.3754824 hartree
pointgroup: C01 [X(C14H12O10)]
dipole: 0.0000965 0.0005513 0.0004006 debye
polarizability: 205.1792352|-0.0558311|262.6537441|0.0313669|-7.9598896|131.8920796 unknown
InChI: InChI=1S/C14H12O10/c1-5(15)21-11-9(19)13(23-7(3)17)14(24-8(4)18)10(20)12(11)22-6(2)16/h1-4H3
charge 0 multiplicity 1
36 atoms
O  -2.464726 1.331383 -0.468136
O  -2.462027 -1.33574 0.469224
O  2.467554 1.336487 -0.467626
O  2.47012 -1.330634 0.469814
O  0.000146 2.593154 -0.839158
O  0.005342 -2.59273 0.839592
O  -2.2242 2.793614 1.359597
O  -2.219434 -2.797087 -1.358905
O  2.223461 2.798097 1.360113
O  2.229345 -2.794092 -1.356898
C  -1.276537 0.661083 -0.176349
C  -1.275203 -0.663121 0.177134
C  1.280671 0.663716 -0.176109
C  1.282007 -0.660475 0.177423
C  0.001335 1.406302 -0.400708
C  0.004138 -1.40591 0.401053
C  -2.78883 2.530022 0.293585
C  -2.784021 -2.534889 -0.292518
C  2.789055 2.535637 0.294323
C  2.794431 -2.529565 -0.291361
C  -3.880432 3.275374 -0.421625
C  -3.875403 -3.281375 0.421848
C  3.87934 3.283298 -0.420494
C  3.885581 -3.274851 0.424609
H  -4.653805 2.578095 -0.782514
H  -3.450014 3.78013 -1.305168
H  -4.320628 4.028001 0.247882
H  -4.649415 -2.584865 0.782861
H  -3.444936 -3.786318 1.305256
H  -4.314827 -4.033938 -0.248242
H  3.448244 3.786994 -1.304311
H  4.654415 2.587673 -0.780928
H  4.317576 4.03697 0.249124
H  3.454845 -3.778659 1.308539
H  4.65924 -2.57763 0.784989
H  4.32549 -4.028254 -0.244215
