program: Gaussian 09
title: 000260499
version: EM64L-G09RevD.01
frameworkgroup: C1[X(C9H8ClN3O2)]
method: RPBEPBE
basis: SDD
operation: Freq
keyword: #p
keyword: freq=noraman
keyword: PBEPBE/SDD
title: #p freq=noraman PBEPBE/SDD
converged: YES YES NO NO
title: Mulliken charges:
elementType: Cl O O N N N C C C C C C C C C H H H H H H H H
charge: 0.007065 -0.156867 -0.209837 -0.159272 -0.370065 -0.017259 0.627870 0.204704 -0.101562 -0.014544 -0.583058 0.135122 -0.606434 -0.637460 -0.222984 0.342697 0.254159 0.259380 0.224279 0.235603 0.253093 0.262119 0.273248
chargesum: 0.00000
title: Mulliken charges with hydrogens summed into heavy atoms:
elementType: Cl O O N N N C C C C C C C C C
charge: 0.007065 -0.156867 -0.209837 -0.159272 -0.027368 -0.017259 0.627870 0.204704 -0.101562 -0.014544 -0.583058 0.135122 0.131384 0.113355 0.050265
polarizability: 2.04684126e+02 2.04791938e+01 1.72239202e+02 -1.61889838e-01 -7.84858434e-01 6.26750939e+01
1716.lowfreq: -5.0034 -0.0026 -0.0021 -0.0017 3.2818 7.8996 48.9495 73.4714 105.7658
frequency: 48.9337 73.4702 105.7655 150.9496 165.7454 185.4637 217.0721 225.8937 239.4346 250.1627 267.8706 310.6640 322.4564 349.5915 354.9844 388.5910 443.2664 501.4084 523.2686 599.0522 618.3338 664.3063 733.6074 752.8356 775.9181 793.3267 809.3784 839.6283 854.7005 914.2189 998.7430 1041.6636 1053.3761 1085.8565 1090.6253 1123.2808 1138.0310 1167.0920 1219.1906 1266.5119 1327.6369 1339.5087 1345.8418 1373.0688 1431.7907 1439.6498 1455.7808 1462.4050 1471.7703 1475.4056 1482.3843 1504.0844 1550.0883 1561.7603 1609.5771 2975.3562 2980.5518 3054.8677 3057.6069 3129.5923 3145.8592 3246.4515 3564.3353
redmass: 5.6640 9.6936 3.2157 6.2144 7.2360 1.8029 7.2037 1.7364 1.9907 2.2716 5.1298 4.4242 4.1356 10.7080 8.5803 4.4444 4.4987 5.6762 7.5733 7.9583 4.0484 9.2174 2.1800 1.9457 9.6644 8.2463 1.6011 6.4775 7.5264 8.1989 4.2215 2.1755 1.5576 1.5369 2.4536 1.3800 2.3296 2.7454 3.3143 3.1439 3.4434 4.4819 4.0568 4.3504 1.1276 1.3303 1.1007 1.0724 1.0473 1.9350 1.8345 6.1632 4.6411 9.5930 9.4375 1.0368 1.0370 1.1008 1.1015 1.0985 1.0976 1.0992 1.0823
irintensity: 8.6818 0.5061 4.1416 1.1889 10.5816 3.4636 0.8018 0.2322 0.1688 8.1253 4.4531 3.6613 1.3439 2.8189 11.8140 8.2853 3.8625 12.0415 7.3213 9.7280 11.0312 0.9290 82.3983 54.0786 18.7702 27.4664 15.8869 1.9688 7.8569 6.8664 150.9027 16.5788 8.5001 18.8729 17.1629 0.1302 90.8830 54.3987 9.6372 20.9569 26.5785 27.4704 14.0740 138.4305 9.8297 64.6728 11.7616 24.1627 10.5840 17.5851 21.5388 139.6284 137.4756 396.5934 34.1669 15.7302 106.3618 37.9873 0.9056 8.2724 8.7950 0.6716 87.3743
temp: 298.150 k
press: 1.00000 atm
elementType: 17 8 8 7 7 7 6 6 6 6 6 6 6 6 6 1 1 1 1 1 1 1 1
symmnumber: 1
zpe: 428562.4 jmol-1
zpe.correction: 0.163231 hartree
zpe.thermalcorrener: 0.176688 hartree
zpe.thermalcorrenthalpy: 0.177632 hartree
zpe.thermalcorrgfe: 0.123034 hartree
zpe.sumelectzpe: -1121.410717 hartree
zpe.sumelectthermal: -1121.397260 hartree
zpe.sumelectthermalent: -1121.396316 hartree
zpe.sumelectthermalfe: -1121.450914 hartree
dipole: -0.7737 -0.1871 0.3838
dipole: 0.8837
quadrupole: -63.6303 -115.3154 -92.0581
quadrupole: 13.8621 -0.8718 1.8387
quadrupole: 26.7043 -24.9808 -1.7235 13.8621 -0.8718 1.8387
hfenergy: -1121.5739482 hartree
pointgroup: C01 [X(C9H8Cl1N3O2)]
dipole: -0.3082839 -0.0654681 0.1467886 debye
dipolederiv: -0.3268332 0.3978127 0.0219545 0.2860313 -0.5091863 -0.0271855 0.0242822 0.0093996 -0.0341644 -0.5706432 -0.1249035 -0.0380891 -0.1189228 -0.8903831 -0.1044075 -0.0521266 -0.1020126 -0.2858324 -0.7671624 -0.259082 -0.0367804 -0.5216042 -0.9498143 -0.1205423 -0.0476183 -0.1060379 -0.3459915 -0.9728097 -0.4747276 -0.0387102 -0.0814707 -0.4083755 0.0170812 0.0197002 -0.0309192 -0.2900699 -0.3482796 -0.2004653 -0.0494602 -0.1844549 -0.2850875 -0.0179149 -0.044497 -0.0214565 -0.1962555 -0.4126414 0.0854306 0.0227935 -0.0471722 -0.2406078 -0.0044723 0.0020546 0.0017067 -0.2340384 0.6849498 0.8975495 0.069819 0.9440123 -0.0781827 -0.1406712 0.185579 -0.0770136 0.0479334 0.1323283 0.5626227 0.1146419 0.4683117 -0.2751483 -0.0664226 0.0989635 -0.0875387 0.0253349 -0.3404581 -0.2615781 -0.0663833 -0.2516551 0.0057804 0.0004 -0.1267993 -0.0338926 -0.0192482 1.1554593 -0.0801462 0.0069052 0.1105112 1.1490923 0.16387 0.1973499 0.3019209 0.2115769 -0.7592244 -0.9046238 -0.0234834 -1.1704099 0.3728926 0.0293681 -0.2937327 -0.1738045 -0.2234388 1.6276254 0.285063 0.0023956 0.4493922 0.9533932 0.1744632 0.01725 0.1835778 0.2611822 0.1943253 0.0656743 0.122467 0.249132 0.4547566 0.0340803 0.2340298 0.0407854 0.1941322 0.3488695 -0.0002605 -0.0877155 -0.3439293 0.052802 -0.0432487 -0.2604382 -0.0766535 0.208712 0.1273003 0.0330583 0.0064866 0.1964381 0.2862024 0.0767796 0.0533836 0.0820254 -0.0390226 0.3184796 0.0590564 0.0121625 0.0128465 0.2021557 -0.0305366 0.0117205 -0.0266549 0.3407922 0.0622376 -0.0282799 -0.0061213 -0.1127705 -0.0844545 0.0417731 -0.00532 0.09592 0.0067802 0.0467734 0.0202711 0.119905 -0.0227932 0.067463 -0.0325373 0.046688 -0.0253129 -0.001938 -0.1602362 -0.0113575 -0.1114321 0.0763446 0.0206526 0.0339093 -0.1397459 -0.0451752 0.0749836 -0.0386344 -0.0753184 0.0712901 -0.113835 -0.0399743 0.0970102 0.1343338 0.0692637 0.0817687 -0.0492256 0.0496499 -0.0152403 0.1699117 0.0250131 0.0278155 -0.0407764 0.0695191 0.013779 0.0412802 -0.0375002 -0.0978812 0.0054123 0.0555958 -0.0924686 -0.0114145 -0.0293736 0.0152892 0.0065197 0.0020545 0.0004759 0.0006738 0.1154146 -0.0161433 -0.0028665 -0.0182729 0.1877352 unknown
polarizability: 208.8479523|16.4745667|165.0992148|0.2851431|17.3477696|65.6512547 unknown
InChI: InChI=1S/C9H8ClN3O2/c1-13(2)7-4(10)8(14)5-6(9(7)15)12-3-11-5/h3,11H,1-2H3
charge 0 multiplicity 1
23 atoms
Cl -1.834003 2.591096 0.192265
O  -0.503289 -2.485526 -0.387437
O  1.1535 2.749733 0.499032
N  -2.477401 -0.512361 -0.00247
N  3.026309 0.463865 0.097163
N  2.43331 -1.682882 -0.3737
C  -1.144317 -0.138951 -0.039339
C  1.643211 0.437509 0.092534
C  1.288524 -0.88745 -0.196353
C  -0.119889 -1.289803 -0.246981
C  -0.687841 1.171497 0.185825
C  0.721829 1.563633 0.298736
C  -3.051982 -1.588402 -0.841717
C  -3.451534 0.0996 0.924698
C  3.463705 -0.83329 -0.188663
H  3.58838 1.299391 0.270564
H  -3.195745 -2.52117 -0.266902
H  -2.404329 -1.813354 -1.698382
H  -4.033575 -1.235611 -1.213423
H  -4.063364 -0.716364 1.354215
H  -4.122381 0.817909 0.418778
H  -2.933739 0.620079 1.74253
H  4.515323 -1.102647 -0.248573
