program: Gaussian 09
title: 000260481
version: EM64L-G09RevD.01
frameworkgroup: C1[X(C6H11BrO2)]
method: RPBEPBE
basis: SDD
operation: Freq
keyword: #p
keyword: freq=noraman
keyword: PBEPBE/SDD
title: #p freq=noraman PBEPBE/SDD
converged: YES YES NO NO
title: Mulliken charges:
elementType: Br O O C C C C C C H H H H H H H H H H H
charge: 0.013620 -0.402289 -0.213197 0.034476 -0.373488 -0.605020 -0.713935 -0.704232 0.249682 0.220737 0.197408 0.225542 0.330674 0.253973 0.212979 0.232304 0.225526 0.221619 0.210877 0.382745
chargesum: 0.00000
title: Mulliken charges with hydrogens summed into heavy atoms:
elementType: Br O O C C C C C C
charge: 0.013620 -0.019544 -0.213197 0.255212 0.049462 -0.274346 -0.014679 -0.046210 0.249682
polarizability: 1.05465064e+02 -7.02627136e+00 8.57676598e+01 -8.65390045e-01 -2.22076270e+00 7.14733672e+01
1716.lowfreq: -8.5905 -0.0008 -0.0006 0.0004 6.1231 14.8654 36.8921 64.5484 72.8759
frequency: 36.8542 64.2376 72.8467 133.1039 142.1487 193.4123 217.0573 237.8926 241.5429 303.4968 333.5750 413.6749 494.3142 537.6425 645.3074 663.5118 738.9524 768.5389 788.1383 855.2854 926.3772 974.5032 1002.1113 1044.1058 1054.9531 1093.8820 1136.3344 1169.4072 1188.2663 1244.7315 1264.0398 1291.1309 1325.5353 1336.6550 1372.3052 1387.9725 1397.2057 1469.1829 1470.9636 1480.4583 1485.7811 1493.2951 1658.0574 2966.5894 2980.3452 2980.9554 3000.0553 3029.7832 3074.5623 3083.2039 3091.1132 3091.9143 3108.9667 3513.4410
redmass: 9.3601 1.9990 2.9290 5.7795 5.9954 1.2882 1.8865 2.0526 2.4034 2.7432 4.2864 2.2132 3.6031 2.7004 1.5712 3.3555 6.6597 1.9155 1.7573 2.3249 2.2615 1.2014 2.0009 2.7418 1.8724 1.6875 1.8803 1.4200 1.7208 1.5132 1.3183 1.2102 1.4776 1.5573 1.4565 1.2196 1.2328 1.0633 1.0449 1.0466 1.0693 1.0460 8.5339 1.0609 1.0381 1.0822 1.0362 1.0989 1.0994 1.0999 1.0965 1.0887 1.1001 1.0641
irintensity: 1.9523 0.0379 0.0055 0.5952 0.5689 0.2433 1.1363 1.4262 1.9666 0.6157 2.5993 0.5299 15.1547 29.1064 185.9332 17.0985 1.5658 4.0219 5.7214 3.7086 42.5247 13.8366 91.7308 74.2584 127.3083 14.4758 5.9765 5.9234 7.2969 1.0878 3.1786 5.0898 15.3651 12.1697 22.0582 8.9097 21.1556 0.4931 20.0940 12.1638 13.1616 11.4112 194.5315 35.9791 33.3080 9.6041 23.6887 15.3558 43.7377 43.5336 24.3056 6.7581 14.8071 33.2055
temp: 298.150 k
press: 1.00000 atm
elementType: 35 8 8 6 6 6 6 6 6 1 1 1 1 1 1 1 1 1 1 1
symmnumber: 1
zpe: 425091.3 jmol-1
zpe.correction: 0.161909 hartree
zpe.thermalcorrener: 0.173132 hartree
zpe.thermalcorrenthalpy: 0.174076 hartree
zpe.thermalcorrgfe: 0.123201 hartree
zpe.sumelectzpe: -398.419287 hartree
zpe.sumelectthermal: -398.408064 hartree
zpe.sumelectthermalent: -398.407120 hartree
zpe.sumelectthermalfe: -398.457995 hartree
dipole: -1.6971 0.6925 -1.4129
dipole: 2.3143
quadrupole: -63.3934 -58.9340 -68.5059
quadrupole: 3.4064 2.4792 -2.0326
quadrupole: 0.2177 4.6770 -4.8948 3.4064 2.4792 -2.0326
hfenergy: -398.5811955 hartree
pointgroup: C01 [X(C6H11Br1O2)]
dipole: 0.606862 0.5784733 0.355105 debye
dipolederiv: -0.4079587 -0.1718525 0.0529267 -0.2542865 -0.3882622 0.1146038 0.0351433 0.080338 -0.1314508 -0.6553331 0.3306619 0.3384879 0.307864 -0.758559 -0.3657031 0.303599 -0.3334848 -0.5232026 -0.4501172 0.2216934 -0.0460061 0.1221619 -0.4956388 0.1542986 0.2377974 0.0012219 -0.9051847 -0.0394461 -0.0813308 0.0342422 -0.2474113 -0.0696886 0.0486662 -0.034005 -0.0022457 0.119779 -0.049477 -0.0389381 0.0372945 0.1973016 0.1637401 -0.0398978 0.0725214 0.0007669 0.1165946 0.613829 0.4387661 -0.1187441 0.401602 0.2829173 -0.0459526 -0.0775809 0.0366009 0.0137798 -0.0225757 -0.0155998 0.032453 -0.0264514 -0.0075581 -0.0576491 0.0077525 -0.0654131 -0.0682989 -0.0337133 0.0051488 0.0177953 -0.1099847 0.0139469 0.0050305 0.0201112 -0.0119448 0.0897057 0.5808215 -0.7343635 -0.2155652 -0.550253 1.0023618 0.0523832 -0.4556401 0.0654156 1.2331523 0.0134285 0.0565176 -0.05297 0.0612155 -0.0252148 0.0766188 -0.0308916 0.0697702 -0.069418 0.0425338 0.0207225 0.0496579 0.0191998 0.0055235 -0.1038458 0.0393615 -0.1325741 -0.1238419 0.0182288 0.0547382 -0.062311 0.034151 -0.0270917 0.0718281 -0.0423127 0.1194388 -0.0193583 0.0073382 -0.0453499 -0.0065867 -0.0444866 -0.0212418 -0.0600818 0.009854 -0.0156649 -0.012675 0.1171342 0.015056 -0.0497312 0.0172043 0.0158808 0.1135204 -0.0371275 0.0528288 0.0108325 -0.1390812 0.098527 0.0832965 0.0908564 0.0853878 -0.0254862 0.0585491 -0.009101 0.0578291 0.0281234 -0.1352051 -0.037836 -0.1038944 -0.04421 -0.0300353 -0.0083535 0.0080852 0.0817829 0.0681757 0.0216275 0.0165527 0.0619597 0.0561145 -0.091829 0.0626068 -0.0842616 -0.1127005 -0.078022 -0.1269221 -0.003235 -0.1435065 -0.0773048 -0.0240343 -0.0154751 -0.0202861 0.0981389 0.0445886 0.033452 -0.0167557 0.0979909 -0.023087 0.1208101 -0.0668108 0.1172899 -0.034525 0.3415226 0.0526506 -0.0529658 0.0687672 0.3119842 0.086755 -0.0790991 0.1232199 0.179061 unknown
polarizability: 97.2258253|10.4842311|91.9781963|-7.9624443|-4.2112128|73.5020695 unknown
InChI: InChI=1S/C6H11BrO2/c1-3-4(2)5(7)6(8)9/h4-5,8H,3H2,1-2H3
charge 0 multiplicity 1
20 atoms
Br -1.752571 -1.806151 0.870208
O  -2.027341 1.637683 0.741277
O  -1.204443 1.03254 -1.344366
C  0.90301 -0.606016 0.165715
C  1.829749 0.652333 0.2153
C  -0.482941 -0.194282 0.703554
C  0.890817 -1.27127 -1.228398
C  3.325084 0.311907 0.031763
C  -1.245473 0.844971 -0.110066
H  1.298919 -1.339074 0.899137
H  1.699601 1.166896 1.190109
H  1.511152 1.365278 -0.570092
H  -0.420267 0.152036 1.746859
H  0.558695 -0.561516 -2.003764
H  1.902448 -1.631328 -1.484405
H  0.21151 -2.140992 -1.245155
H  3.526385 -0.116005 -0.965965
H  3.945835 1.220173 0.136794
H  3.663558 -0.418355 0.790766
H  -2.549523 2.289474 0.198629
