program: Gaussian 09
title: 000260551
version: EM64L-G09RevD.01
frameworkgroup: C1[X(C24H24N2)]
method: RPBEPBE
basis: SDD
operation: Freq
keyword: #pfreq=noraman
keyword: PBEPBE/SDD
title: #p freq=noraman PBEPBE/SDD
converged: YES YES NO NO
title: Mulliken charges:
elementType: N N C C C C C C C C C C C C C C C C C C C C C C C C H H H H H H H H H H H H H H H H H H H H H H H H
charge: -0.164495 -0.150675 0.046797 0.178875 0.294271 0.140214 0.142477 -0.558222 -0.432362 0.430480 -0.444966 -0.430425 -0.401550 -0.388980 0.453847 -0.245652 -0.277503 -0.423509 -0.429744 0.390110 -0.646667 -0.650170 -0.373561 -0.370134 -0.646613 -0.645966 0.245565 0.236901 0.216883 0.242096 0.276457 0.234850 0.220233 0.219561 0.277119 0.227722 0.231662 0.230873 0.213342 0.232026 0.231628 0.214930 0.238611 0.235425 0.234806 0.217122 0.238109 0.217327 0.234551 0.236322
chargesum: 0.00000
title: Mulliken charges with hydrogens summed into heavy atoms:
elementType: N N C C C C C C C C C C C C C C C C C C C C C C C C
charge: -0.164495 -0.150675 0.046797 0.178875 0.294271 0.140214 0.142477 -0.312657 -0.195461 0.430480 -0.228082 -0.188328 -0.125093 -0.154130 0.453847 -0.025419 -0.057942 -0.146390 -0.202022 0.390110 0.029209 0.028414 -0.134950 -0.134709 0.043425 0.042234
polarizability: 5.73686134e+02 8.84109778e+00 3.60476870e+02 4.42553693e+00 1.09878671e+01 1.42837042e+02
1716.lowfreq: -5.2429 -3.6735 -0.0006 -0.0001 0.0005 2.4319 24.9548 30.3514 37.8457
frequency: 24.9173 30.3404 37.8248 55.8446 57.1247 74.0818 90.1860 97.8054 102.5205 121.3794 130.0575 146.6626 160.7867 188.8081 197.2466 199.8194 212.3828 239.0088 245.8842 264.6717 299.8132 313.5304 347.0659 372.7146 400.4164 411.7225 423.3141 440.0878 447.7344 464.1599 478.5012 487.8103 524.0014 533.0811 538.1443 564.2557 574.0582 589.1312 631.5490 651.3503 653.1382 697.4164 717.2609 726.7235 736.9109 746.1370 766.9360 775.3629 777.3653 803.6651 809.4184 819.4203 847.0307 855.3631 871.0718 880.8705 920.6312 939.9121 941.3715 943.2125 948.0901 967.2865 970.2077 987.4076 996.7032 1002.8467 1033.8056 1055.0974 1055.5566 1073.9741 1107.1724 1108.8493 1110.1002 1110.4707 1121.5240 1136.1367 1141.8153 1153.1264 1166.4233 1175.6300 1200.6479 1207.1956 1240.4236 1254.0700 1260.4196 1266.5676 1286.4835 1311.5992 1320.0598 1350.0963 1355.3471 1364.6164 1374.2395 1387.3832 1394.2567 1427.7132 1428.5512 1444.5112 1445.2307 1450.1593 1455.5977 1458.8124 1461.3326 1463.5895 1470.6420 1472.4141 1475.4406 1491.8425 1493.1728 1498.3564 1505.4329 1512.7022 1527.1481 1547.0625 1575.9143 1581.9282 1604.6276 1618.3083 1630.4671 1636.9619 2929.0352 2938.1962 2939.5939 2947.2658 2991.5999 2995.5676 3005.6610 3008.6852 3062.4323 3089.0397 3095.8553 3099.6481 3105.8671 3116.2162 3117.4069 3124.7893 3130.9246 3145.0762 3149.2103 3149.8234 3163.8105 3166.0525 3167.7124 3170.9357
redmass: 3.8569 3.9748 3.5629 3.0575 3.1578 2.6730 2.9870 2.1187 2.0397 2.7107 2.9170 2.6447 1.8891 2.0695 1.6677 2.9523 1.3468 3.2110 2.8806 2.9455 4.0006 3.9566 4.0108 4.1103 3.5885 3.1049 3.0707 3.5769 2.9963 3.8300 3.7957 3.8393 3.8813 2.8449 4.2739 4.2947 4.6033 3.1897 7.0046 5.4490 3.5875 5.1202 3.6408 5.0665 2.0455 4.4964 2.3310 3.4194 2.8040 1.4385 1.6131 1.6567 3.4860 2.1286 1.5055 1.6306 3.5508 1.3825 1.5505 2.7470 1.4308 1.4444 2.8366 1.3175 2.8590 3.8609 2.0644 1.4930 1.4966 3.2340 1.2392 1.3053 1.3228 1.2487 1.7453 1.5218 1.7011 1.5751 1.6844 1.1990 1.5542 1.3279 1.8154 2.0757 2.8682 2.6548 1.7044 1.9291 1.6481 2.1696 3.0584 3.4621 7.4451 3.2823 2.2771 1.2096 1.3201 2.0888 2.4324 1.9431 2.4534 1.2624 1.0411 1.0403 2.4394 1.0478 1.0461 1.1050 1.5320 1.3998 1.1466 1.3064 2.5647 6.1340 6.7779 6.3045 6.8285 6.5659 6.6013 7.3687 1.0370 1.0396 1.0370 1.0395 1.0996 1.1022 1.0993 1.1023 1.0860 1.0956 1.0962 1.0934 1.0941 1.0892 1.0849 1.0892 1.0904 1.0883 1.0895 1.0951 1.0937 1.0954 1.0930 1.0956
irintensity: 0.6530 1.6902 0.6831 0.8198 1.4741 0.6262 4.7320 1.2089 1.6899 0.2001 0.3481 0.8961 0.0440 0.6666 0.3289 0.9022 0.9609 0.9647 1.6356 3.9405 2.9881 0.1183 2.2210 2.6780 3.1240 8.1302 2.2089 2.0522 2.7143 1.6188 1.4787 14.7477 8.4647 16.8610 4.8694 7.3635 3.3726 3.7736 0.0183 1.1967 4.9686 3.7676 5.2491 5.8614 47.8884 10.8087 18.3777 19.3354 18.3671 34.6239 1.9160 45.8752 11.2709 28.7854 19.4628 24.7809 26.7050 1.0154 7.1892 35.8796 5.7688 1.6192 3.1327 1.0181 0.0482 3.4273 7.5416 26.8340 25.1739 16.2966 0.1589 1.0494 2.0422 0.2060 24.6693 5.6400 5.7659 13.5879 11.2531 4.9596 62.7113 55.4686 51.0789 11.5162 27.3385 10.7442 11.8631 9.4849 13.4084 33.5619 87.0537 326.6431 12.0224 2.5166 7.0751 1.2912 8.1107 76.4196 23.0376 37.9805 22.3617 45.1077 0.0376 0.1124 21.4937 20.2390 21.7143 0.7900 32.0977 11.3701 43.8833 294.4872 373.9851 2.2869 7.7453 25.0624 372.8889 329.6347 177.3164 125.5062 100.7124 160.7152 109.6632 185.1503 19.2304 79.9366 7.9427 77.4546 18.3461 4.2881 4.1578 61.3123 54.4646 10.6924 4.1183 11.6839 14.9480 21.1714 11.5175 41.7469 20.5081 18.9397 32.9639 18.9665
temp: 298.150 k
press: 1.00000 atm
elementType: 7 7 6 6 6 6 6 6 6 6 6 6 6 6 6 6 6 6 6 6 6 6 6 6 6 6 1 1 1 1 1 1 1 1 1 1 1 1 1 1 1 1 1 1 1 1 1 1 1 1
symmnumber: 1
zpe: 1081920.4 jmol-1
zpe.correction: 0.412082 hartree
zpe.thermalcorrener: 0.436076 hartree
zpe.thermalcorrenthalpy: 0.437020 hartree
zpe.thermalcorrgfe: 0.357371 hartree
zpe.sumelectzpe: -1036.619515 hartree
zpe.sumelectthermal: -1036.595521 hartree
zpe.sumelectthermalent: -1036.594577 hartree
zpe.sumelectthermalfe: -1036.674226 hartree
dipole: -3.1320 -3.7834 0.3435
dipole: 4.9236
quadrupole: -92.1327 -136.4361 -160.9742
quadrupole: -6.8640 -0.1316 4.6649
quadrupole: 37.7150 -6.5885 -31.1265 -6.8640 -0.1316 4.6649
hfenergy: -1037.0315971 hartree
pointgroup: C01 [X(C24H24N2)]
dipole: 1.1466468 -1.5472121 0.2089892 debye
polarizability: 572.0725437|-19.8862725|346.3496444|5.8972976|-57.7332223|158.5778584 unknown
InChI: InChI=1S/C24H24N2/c1-25(2)18-11-9-17(10-12-18)15-23-21-8-6-5-7-20(21)22-14-13-19(26(3)4)16-24(22)23/h5-16H,1-4H3
charge 0 multiplicity 1
50 atoms
N  -5.001257 -2.136841 0.357041
N  6.033618 -1.305547 0.058475
C  -2.042728 0.1308 0.009538
C  -2.677114 1.357892 -0.360594
C  -0.563375 0.336697 0.048888
C  -1.638337 2.383762 -0.520016
C  -0.353769 1.779889 -0.269293
C  -2.798557 -1.032777 0.237436
C  -4.078558 1.405294 -0.494893
C  -4.225623 -0.991579 0.116993
C  0.315542 -0.679611 0.373494
C  -1.74934 3.759391 -0.810178
C  0.79974 2.596796 -0.255926
C  -4.846906 0.248091 -0.25758
C  1.774705 -0.780036 0.282765
C  -0.580306 4.556315 -0.826472
C  0.681589 3.980574 -0.53502
C  2.561086 -0.114456 -0.704916
C  2.469932 -1.671476 1.154119
C  4.647071 -1.145971 0.124653
C  -6.460299 -2.078398 0.224277
C  -4.353075 -3.396734 0.732561
C  3.950188 -0.289684 -0.790272
C  3.860607 -1.846312 1.096662
C  6.811167 -0.579842 -0.954059
C  6.715633 -2.210479 0.992139
H  -2.299004 -1.969454 0.500558
H  -4.584248 2.334333 -0.782518
H  -0.158398 -1.598528 0.754106
H  -2.728321 4.21229 -1.004473
H  1.780926 2.182098 -0.011222
H  -5.933306 0.304062 -0.366051
H  -0.651379 5.627077 -1.050405
H  1.577053 4.612378 -0.522437
H  2.062031 0.512893 -1.449832
H  1.897824 -2.228172 1.907444
H  -6.908813 -1.335004 0.915489
H  -6.774316 -1.814038 -0.807078
H  -6.890008 -3.063861 0.46515
H  -3.662782 -3.761071 -0.056942
H  -3.76984 -3.29645 1.671649
H  -5.120061 -4.171115 0.893367
H  4.495563 0.228281 -1.584259
H  4.337045 -2.532388 1.802512
H  6.523277 -0.86977 -1.985536
H  7.881513 -0.805222 -0.82559
H  6.681189 0.517169 -0.860069
H  7.798928 -2.192279 0.794747
H  6.367118 -3.257986 0.882404
H  6.556575 -1.907395 2.046969
