program: Gaussian 09
title: 000260490
version: EM64L-G09RevD.01
frameworkgroup: C1[X(C10H20N2O2)]
method: RPBEPBE
basis: SDD
operation: Freq
keyword: #p
keyword: freq=noraman
keyword: PBEPBE/SDD
title: #p freq=noraman PBEPBE/SDD
converged: YES YES NO NO
title: Mulliken charges:
elementType: O O N N C C C C C C C C C C H H H H H H H H H H H H H H H H H H H H
charge: -0.290881 -0.436555 -0.152411 -0.053114 0.368063 -0.483502 -0.427678 -0.405778 -0.385301 -0.483689 -0.299728 -0.382418 -0.619349 -0.336986 0.213469 0.215183 0.196111 0.229609 0.210653 0.205148 0.204954 0.203109 0.229251 0.244708 0.207272 0.204640 0.216628 0.228025 0.222265 0.221133 0.188244 0.204066 0.210829 0.334030
chargesum: 0.00000
title: Mulliken charges with hydrogens summed into heavy atoms:
elementType: O O N N C C C C C C C C C C
charge: -0.290881 -0.102525 -0.152411 -0.053114 0.368063 -0.054850 -0.001958 0.010023 0.022762 -0.009731 0.112184 0.062235 0.012293 0.077910
polarizability: 1.48616148e+02 2.64487520e+00 1.21731328e+02 -1.67379584e+00 3.18967202e+00 1.04905418e+02
1716.lowfreq: -23.2669 -10.9903 -0.0003 -0.0003 0.0002 9.7994 30.7413 52.0082 73.5836
frequency: 28.8749 51.9991 73.5831 79.2064 112.8550 161.8714 186.5045 198.9279 241.2237 242.5597 263.3624 306.0792 315.6911 338.1330 343.2049 372.5970 375.4414 473.8688 489.1995 496.0108 577.4138 612.6525 652.4277 722.0787 747.0352 788.8714 799.9022 813.7933 825.8707 898.2248 929.4178 941.9943 959.5654 975.1619 990.4753 1012.0978 1029.1112 1037.9785 1057.1648 1070.1558 1072.3145 1085.2357 1100.0305 1128.1342 1140.1618 1145.6432 1147.5793 1166.8180 1181.7615 1187.9770 1244.5051 1262.1479 1270.0028 1281.2000 1293.5505 1299.3733 1301.1960 1309.4092 1317.5612 1321.1669 1351.5692 1354.2098 1358.1998 1380.1370 1385.8267 1429.5045 1433.1986 1446.4995 1459.5288 1462.6942 1463.6476 1480.8360 1481.3843 1482.4774 1483.1989 1493.8210 2851.7314 2867.7423 2879.6014 2919.0758 2984.2290 2985.6108 2996.5052 3004.4520 3015.2923 3019.2696 3021.7577 3027.8044 3041.7585 3048.4631 3067.9846 3072.4569 3073.3543 3085.0875 3094.5039 3561.9269
redmass: 3.2148 3.1215 2.6794 3.0262 2.4272 2.6174 2.4293 3.0574 1.5847 1.8363 4.9722 1.8364 1.4708 2.1756 2.1080 2.4390 2.4216 2.7778 2.9656 3.5080 3.6736 3.1135 3.1553 6.3650 3.6328 2.2236 1.2930 1.7087 1.4986 3.3798 2.9835 2.2059 4.2318 3.4998 2.9007 1.5950 2.6390 1.7687 3.0054 1.8815 1.5460 1.7953 1.9336 1.7499 1.7085 2.2808 1.8932 1.3340 1.2917 1.4177 1.8541 1.5982 1.8537 1.2951 1.4978 1.2936 1.2738 1.2552 1.3770 1.5142 1.4133 1.5091 1.2939 1.3836 1.2876 1.1748 1.0947 1.1015 1.0689 1.0570 1.0755 1.0873 1.0880 1.0743 1.0799 1.0830 1.0581 1.0698 1.0679 1.0689 1.0652 1.0573 1.0611 1.0634 1.0728 1.0716 1.0853 1.0866 1.1023 1.0899 1.1020 1.1021 1.1009 1.1003 1.1033 1.0663
irintensity: 2.4324 2.9152 4.9464 1.6587 4.5590 1.4247 5.4037 0.7679 0.8111 0.9191 0.4187 60.8139 97.6741 18.8486 1.2022 13.3354 8.9142 0.6834 3.8460 10.0814 5.4466 14.5035 5.8133 9.7695 24.3870 27.0242 8.7871 9.6711 1.2400 20.2314 5.3588 8.4252 91.2138 22.7603 34.0797 8.9425 27.5995 26.2587 5.3645 18.4651 2.6174 32.8377 49.1062 20.6436 31.9846 5.0186 13.6514 10.2445 1.4020 14.5150 14.6660 8.8402 24.4663 5.8082 5.1060 10.9411 15.4670 0.8779 2.3796 2.2004 25.6233 21.0963 14.5919 0.9485 3.7163 1.1306 6.9536 7.3368 8.9404 16.8212 3.0880 8.1319 4.9246 2.8864 25.8172 2.1426 85.4617 64.0883 133.3612 44.9147 39.3124 104.6033 16.1025 21.5140 46.0356 17.8489 82.1338 30.8473 48.0881 8.7051 16.2359 40.3528 38.6299 48.7638 34.9776 7.2805
temp: 298.150 k
press: 1.00000 atm
elementType: 8 8 7 7 6 6 6 6 6 6 6 6 6 6 1 1 1 1 1 1 1 1 1 1 1 1 1 1 1 1 1 1 1 1
symmnumber: 1
zpe: 780047.1 jmol-1
zpe.correction: 0.297104 hartree
zpe.thermalcorrener: 0.311916 hartree
zpe.thermalcorrenthalpy: 0.312860 hartree
zpe.thermalcorrgfe: 0.254933 hartree
zpe.sumelectzpe: -651.811282 hartree
zpe.sumelectthermal: -651.796470 hartree
zpe.sumelectthermalent: -651.795526 hartree
zpe.sumelectthermalfe: -651.853453 hartree
dipole: -0.8144 0.1227 0.2338
dipole: 0.8562
quadrupole: -97.1627 -77.3357 -89.0156
quadrupole: 1.6133 0.1892 3.8274
quadrupole: -9.3247 10.5023 -1.1776 1.6133 0.1892 3.8274
hfenergy: -652.108386 hartree
pointgroup: C01 [X(C10H20N2O2)]
dipole: 0.3116583 -0.0173845 0.126611 debye
polarizability: 148.1456375|3.8870422|118.8157773|4.1266947|-6.8819904|108.2914792 unknown
InChI: InChI=1S/C10H20N2O2/c1-11-4-2-10(3-5-11)12(6-8-13)7-9-14-10/h13H,2-9H2,1H3
charge 0 multiplicity 1
34 atoms
O  0.339746 -1.482743 -0.702239
O  -4.586319 1.411112 -0.883869
N  -1.370162 -0.180093 0.348352
N  2.835002 0.871522 0.260128
C  0.082297 -0.179166 0.058801
C  0.595713 0.954679 -0.842243
C  0.897958 -0.210812 1.375385
C  2.122186 0.854258 -1.040275
C  2.411681 -0.273314 1.104345
C  -1.68662 -1.614955 0.615648
C  -0.755593 -2.412527 -0.355957
C  -2.296704 0.455059 -0.624661
C  4.299262 0.920659 0.084812
C  -3.618657 0.846148 0.070257
H  0.354761 1.927314 -0.373032
H  0.108644 0.898148 -1.831985
H  0.597566 -1.077259 1.991795
H  0.664131 0.710358 1.939854
H  2.347188 -0.076233 -1.619109
H  2.468095 1.717349 -1.639817
H  2.962822 -0.223907 2.062431
H  2.654824 -1.251489 0.617088
H  -2.755048 -1.815001 0.436935
H  -1.465694 -1.864853 1.667753
H  -0.339421 -3.320141 0.119692
H  -1.274148 -2.697385 -1.291123
H  -2.528465 -0.190354 -1.502988
H  -1.828685 1.376853 -1.012141
H  4.789923 0.984816 1.072806
H  4.57637 1.820762 -0.493449
H  4.712592 0.026565 -0.448563
H  -3.403388 1.543023 0.905903
H  -4.132479 -0.038667 0.480936
H  -4.23258 2.266575 -1.236168
