program: Gaussian 09
title: 000260506
version: EM64L-G09RevD.01
frameworkgroup: C1[X(C18H12O4)]
method: RPBEPBE
basis: SDD
operation: Freq
keyword: #pfreq=noraman
keyword: PBEPBE/SDD
title: #p freq=noraman PBEPBE/SDD
converged: YES YES NO NO
title: Mulliken charges:
elementType: O O O O C C C C C C C C C C C C C C C C C C H H H H H H H H H H H H
charge: -0.136055 -0.189552 -0.145957 -0.202912 -0.449933 0.265805 0.248472 -0.030758 0.009819 0.227995 -0.656970 -0.360737 -0.368306 0.131237 -0.204766 -0.204328 0.323720 -0.357618 -0.349940 -0.253198 -0.232019 -0.225240 0.299658 0.286917 0.278616 0.282705 0.278198 0.245213 0.244527 0.268439 0.277216 0.233222 0.233668 0.232861
chargesum: 0.00000
title: Mulliken charges with hydrogens summed into heavy atoms:
elementType: O O O O C C C C C C C C C C C C C C C C C C
charge: -0.136055 -0.189552 -0.145957 -0.202912 -0.150276 0.265805 0.248472 -0.030758 0.009819 0.227995 -0.091437 -0.078032 -0.090108 0.131237 0.040447 0.040199 0.323720 -0.089179 -0.072724 -0.019976 0.001649 0.007621
polarizability: 2.43953093e+02 1.35314919e+01 2.30676979e+02 -8.89322073e+00 6.32084747e+00 1.34359059e+02
1716.lowfreq: -9.8716 -3.0039 -0.0005 -0.0004 0.0002 2.4461 17.1978 18.0813 40.2254
frequency: 17.1089 18.0495 40.2038 45.2514 55.6620 92.0072 118.5846 131.5338 146.1258 168.8530 198.8169 212.6414 228.1667 236.7587 326.0750 362.0575 400.1862 401.4488 425.1311 433.5969 455.4406 496.3370 514.5649 524.9109 534.4293 560.7793 588.7346 608.5863 612.8694 646.3597 683.1969 696.7887 713.9583 748.9806 764.3865 771.9396 785.0987 807.1724 831.5057 864.1465 899.9465 911.0274 917.4469 954.6559 970.7140 985.6993 988.6045 995.4056 1004.2089 1010.5882 1013.3618 1014.4743 1029.7131 1047.2908 1069.6243 1082.5813 1089.5125 1129.2460 1170.5377 1173.4659 1175.6644 1189.7205 1194.8377 1213.0844 1248.4451 1277.6772 1282.2642 1288.8409 1324.1448 1388.6950 1410.5697 1427.2744 1436.9708 1452.8076 1454.2471 1483.3532 1571.3856 1588.9088 1597.4706 1598.3764 1612.2488 1621.7793 1632.0779 1667.5894 2983.8899 3039.1822 3041.0420 3128.6758 3138.6465 3141.0724 3148.6986 3154.6876 3159.1010 3166.3888 3169.3961 3175.4524
redmass: 6.5397 6.3307 8.6318 4.9521 5.2366 8.7787 5.8299 8.0543 7.3276 5.6794 7.3744 6.0355 4.4575 6.9594 10.6718 4.3782 3.1324 3.0772 4.0481 4.2750 3.0944 4.7877 6.7784 7.4974 6.2672 6.9567 4.9634 3.7818 6.3878 6.2913 5.2636 1.9637 4.8945 2.1471 2.3788 4.0229 1.9887 2.9896 3.6510 1.2446 3.8042 1.7391 3.0645 1.5169 4.2004 1.4277 5.9265 1.3923 3.2394 1.3489 2.9949 1.3693 2.3464 2.3761 3.2909 2.3939 1.6051 1.3127 1.3136 1.1114 1.1644 1.8530 1.1299 1.5346 3.7381 2.0529 1.6318 2.4016 1.3210 8.8087 7.4957 1.1827 2.0889 2.5160 2.5873 2.1721 7.1506 7.7654 7.2577 7.1428 6.4011 9.9120 9.3528 11.4955 1.0598 1.0846 1.0982 1.0852 1.0883 1.0867 1.0927 1.0904 1.0962 1.0958 1.1012 1.1004
irintensity: 0.9593 0.8380 3.8961 1.9254 1.5833 2.1126 2.2616 3.0113 3.1161 0.2794 0.0125 5.5995 5.3543 0.1568 7.2973 0.7062 0.6587 1.7858 1.3169 0.6087 0.7062 4.4269 1.0435 1.3192 9.9796 53.4356 23.8930 0.4010 0.2019 5.6762 0.5405 48.9822 2.9234 30.3307 21.2573 1.1018 76.5323 18.6920 7.2511 0.8582 0.7342 2.1074 6.2991 6.3595 39.5323 4.4051 0.4997 0.8828 2.1764 0.4463 9.1735 0.6105 55.6589 158.5798 77.2808 6.1811 8.4524 65.9616 42.7585 12.7980 0.7298 36.4405 13.8298 129.6412 282.6404 62.8273 8.5533 202.0726 4.3111 2.7877 5.6510 36.2633 38.5765 1.7984 0.2861 3.6390 115.4482 203.8047 33.6193 45.3029 20.9283 172.1134 78.0768 113.9953 3.0753 2.4339 3.3861 0.3471 8.6339 1.6060 8.7504 4.0453 11.2273 3.4892 26.0426 20.1227
temp: 298.150 k
press: 1.00000 atm
elementType: 8 8 8 8 6 6 6 6 6 6 6 6 6 6 6 6 6 6 6 6 6 6 1 1 1 1 1 1 1 1 1 1 1 1
symmnumber: 1
zpe: 653826.3 jmol-1
zpe.correction: 0.249029 hartree
zpe.thermalcorrener: 0.267329 hartree
zpe.thermalcorrenthalpy: 0.268273 hartree
zpe.thermalcorrgfe: 0.199373 hartree
zpe.sumelectzpe: -992.495669 hartree
zpe.sumelectthermal: -992.477370 hartree
zpe.sumelectthermalent: -992.476425 hartree
zpe.sumelectthermalfe: -992.545325 hartree
dipole: 3.9584 5.7030 1.3627
dipole: 7.0746
quadrupole: -105.0755 -127.2166 -128.7985
quadrupole: 0.9824 -1.2538 -10.0239
quadrupole: 15.2880 -6.8530 -8.4350 0.9824 -1.2538 -10.0239
hfenergy: -992.7446981 hartree
pointgroup: C01 [X(C18H12O4)]
dipole: 1.4435259 2.3741291 -0.1637973 debye
polarizability: 242.4831516|10.7711808|227.1072971|-13.2723331|-22.2427786|139.3986826 unknown
InChI: InChI=1S/C18H12O4/c19-14(11-6-2-1-3-7-11)10-15(20)16-17(21)12-8-4-5-9-13(12)18(16)22/h1-9,16H,10H2
charge 0 multiplicity 1
34 atoms
O  2.769681 -2.671544 0.367829
O  0.516746 1.390868 1.763558
O  -0.26617 -1.608647 -0.652482
O  -3.337993 -2.642422 0.86591
C  1.164242 -0.967803 1.231745
C  3.095594 -0.2820 -0.112406
C  2.453042 0.908301 0.31955
C  2.405704 -1.475763 0.460876
C  1.29165 0.58119 1.189313
C  -0.182565 -1.376363 0.573137
C  -1.360424 -1.428958 1.548045
C  4.228594 -0.23455 -0.949441
C  2.92696 2.178565 -0.071499
C  -2.732376 -1.532153 0.866655
C  4.704844 1.035879 -1.346659
C  4.061825 2.229214 -0.911818
C  -3.319288 -0.316996 0.2181
C  -2.734709 0.973751 0.334072
C  -4.518242 -0.473662 -0.531298
C  -3.341403 2.084282 -0.291154
C  -5.11853 0.634768 -1.157074
C  -4.530714 1.918532 -1.037961
H  1.162987 -1.322194 2.278673
H  -1.226956 -2.335074 2.172023
H  -1.288092 -0.554295 2.224165
H  4.713377 -1.159351 -1.276698
H  2.42364 3.088498 0.269624
H  5.581982 1.108575 -1.998612
H  4.456176 3.198112 -1.236279
H  -1.818193 1.128715 0.913588
H  -4.951814 -1.476313 -0.606702
H  -2.888705 3.07698 -0.194439
H  -6.038956 0.505305 -1.736658
H  -4.997815 2.782955 -1.523384
