program: Gaussian 09
title: 000260457
version: EM64L-G09RevD.01
frameworkgroup: C1[X(C11H8ClN3O4S)]
method: RPBEPBE
basis: SDD
operation: Freq
keyword: #p
keyword: freq=noraman
keyword: PBEPBE/SDD
title: #p freq=noraman PBEPBE/SDD
converged: NO NO NO NO
title: Mulliken charges:
elementType: Cl S O O O O N N N C C C C C C C C C C C H H H H H H H H
charge: 0.060870 0.855531 -0.529337 -0.529339 -0.208035 -0.171246 -0.415946 0.018736 0.017949 0.547772 -0.515777 -0.350295 -0.241548 0.520115 -0.519899 0.507979 -0.379227 -0.384534 -0.314799 -0.175821 0.305927 0.290958 0.257001 0.290098 0.289762 0.279776 0.223194 0.270136
chargesum: 0.00000
title: Mulliken charges with hydrogens summed into heavy atoms:
elementType: Cl S O O O O N N N C C C C C C C C C C C
charge: 0.060870 0.855531 -0.529337 -0.529339 -0.208035 -0.171246 -0.125848 0.018736 0.017949 0.547772 -0.209849 -0.059338 0.015452 0.520115 -0.230137 0.507979 -0.099451 -0.161340 -0.314799 0.094316
polarizability: 4.37635095e+02 -3.91634913e+00 2.04511410e+02 -1.00129991e-02 2.23089873e-03 9.14271674e+01
1716.lowfreq: -34.2269 -11.3609 -5.3623 -3.7773 0.0014 0.0015 0.0019 14.0934 29.4114
frequency: -34.2220 14.0896 29.3542 31.5255 65.1686 104.7419 106.6229 133.2049 148.2483 186.0692 218.1637 220.9601 241.8560 248.2753 282.2276 310.4784 314.4619 334.8851 364.6007 389.1565 400.4618 424.3909 431.7784 474.1543 485.5306 539.5405 547.2513 571.4404 594.2632 605.2226 645.1184 649.6745 652.4243 688.9315 700.6145 723.2204 741.7933 768.0412 800.1223 805.0793 848.0694 898.5398 904.0631 909.3818 925.1712 935.5860 954.8299 990.2495 1019.8471 1037.7981 1085.4072 1104.5065 1123.7104 1150.9096 1194.4612 1215.6113 1232.5563 1272.8559 1298.3599 1331.8615 1370.0310 1384.9366 1416.9416 1469.6375 1531.8663 1549.1122 1565.2630 1584.8672 1607.6750 1642.6892 2996.3061 3139.6417 3159.6901 3163.7240 3182.2050 3244.4124 3271.5058 3394.5598
redmass: 16.2560 9.2824 7.7912 10.4984 9.5265 5.6537 10.0824 5.6314 5.6633 10.0350 4.6725 15.3552 3.6560 10.0753 8.6855 8.8219 5.0619 13.9383 4.4072 7.1202 3.3737 8.3787 3.5469 10.0227 7.2524 9.3490 3.1719 1.5696 1.9648 6.4409 6.5867 1.3285 7.2246 4.6203 8.3261 5.3688 1.8282 6.0022 8.1640 6.3678 1.3598 3.5519 1.4282 1.4432 11.8801 2.4672 1.5812 1.3681 6.2097 1.1516 6.6797 2.2519 1.6629 1.3533 11.8124 1.6354 1.5598 1.6778 2.2885 2.2151 3.2833 4.9285 6.9196 2.8654 1.8104 8.0560 7.5164 6.2201 6.4323 7.1189 1.0880 1.0922 1.0912 1.0886 1.0976 1.1047 1.0993 1.0754
irintensity: 0.0123 7.1449 0.0723 5.2074 0.0002 0.1605 0.6745 0.7416 3.4773 3.8047 5.7252 0.2661 20.6304 7.0309 8.3373 50.5318 4.3834 5.5273 1.9112 29.3194 1.2299 2.8662 0.4347 13.0398 8.7636 23.3757 7.4628 42.1585 78.4809 12.8602 14.5154 0.1903 1.7411 0.3803 50.1007 3.0050 102.4678 21.6569 24.1426 161.1684 24.2208 1.7553 0.9771 1.6181 115.1658 0.3804 56.3428 0.1454 61.6868 7.9507 182.3006 18.9858 22.5273 2.1258 327.6085 52.6369 21.2286 7.8735 115.3147 22.6491 36.5614 43.6457 23.9464 133.1594 58.5584 12.4695 154.4814 46.3771 19.4591 272.3007 41.3803 3.7929 9.8276 0.0583 1.0607 8.8362 16.7061 3.4764
temp: 298.150 k
press: 1.00000 atm
elementType: 17 16 8 8 8 8 7 7 7 6 6 6 6 6 6 6 6 6 6 6 1 1 1 1 1 1 1 1
symmnumber: 1
zpe: 467153.6 jmol-1
zpe.correction: 0.177929 hartree
zpe.thermalcorrener: 0.195937 hartree
zpe.thermalcorrenthalpy: 0.196881 hartree
zpe.thermalcorrgfe: 0.129062 hartree
zpe.sumelectzpe: -1745.464975 hartree
zpe.sumelectthermal: -1745.446968 hartree
zpe.sumelectthermalent: -1745.446023 hartree
zpe.sumelectthermalfe: -1745.513843 hartree
dipole: -0.0827 5.1830 -0.0034
dipole: 5.1837
quadrupole: -200.2743 -118.8131 -139.7320
quadrupole: 45.2816 0.0224 0.0009
quadrupole: -47.3345 34.1267 13.2078 45.2816 0.0224 0.0009
hfenergy: -1745.6429047 hartree
pointgroup: C01 [X(C11H8Cl1N3O4S1)]
dipole: 0.0669868 2.0383093 0.0034495 debye
polarizability: 437.7008542|-0.022151|204.4455198|-0.0663322|0.1158618|91.4272986 unknown
InChI: InChI=1S/C11H8ClN3O4S/c12-10-2-1-8(5-11(10)15(16)17)6-13-14-9-3-4-20(18,19)7-9/h1-7,14H
charge 0 multiplicity 1
28 atoms
Cl 5.289715 -2.396813 -0.003265
S  -5.512262 -0.819534 -0.000053
O  -6.053256 -1.451121 1.404583
O  -6.052514 -1.448698 -1.406058
O  5.036277 2.199205 0.000524
O  6.293753 0.303266 -0.001887
N  -2.069662 1.27969 0.002673
N  -0.964933 0.463713 0.002268
N  5.163093 0.911564 0.000282
C  -3.345397 0.719748 0.001822
C  -3.647622 -0.612748 0.000611
C  -5.7303 1.093344 0.001535
C  -4.505575 1.661668 0.002354
C  1.443083 0.218451 0.001416
C  2.702306 0.858093 0.001455
C  3.903242 0.111718 0.000103
C  1.403328 -1.207147 -0.00015
C  0.225508 1.033068 0.002934
C  3.854757 -1.306349 -0.001398
C  2.591526 -1.949546 -0.001508
H  -3.022306 -1.49998 0.0000
H  -6.739189 1.502774 0.001617
H  -4.349516 2.746895 0.003308
H  -1.972928 2.305842 0.003461
H  2.79139 1.949203 0.002589
H  0.433513 -1.712728 -0.000231
H  0.355943 2.132891 0.003491
H  2.56073 -3.042668 -0.002678
