program: Gaussian 09
title: 000260460
version: EM64L-G09RevD.01
frameworkgroup: C1[X(C12H10N2O4S)]
method: RPBEPBE
basis: SDD
operation: Freq
keyword: #p
keyword: freq=noraman
keyword: PBEPBE/SDD
title: #p freq=noraman PBEPBE/SDD
converged: YES YES NO NO
title: Mulliken charges:
elementType: S O O O O N N C C C C C C C C C C C C H H H H H H H H H H
charge: 0.853824 -0.533753 -0.533725 -0.473533 -0.246632 -0.413743 0.005668 0.544149 -0.519549 -0.353774 -0.242778 0.321060 0.113076 -0.344826 -0.395875 -0.325865 -0.221807 -0.224805 0.134146 0.305772 0.289182 0.255725 0.288377 0.275066 0.291113 0.279174 0.240671 0.242938 0.390723
chargesum: 0.00000
title: Mulliken charges with hydrogens summed into heavy atoms:
elementType: S O O O O N N C C C C C C C C C C C C
charge: 0.853824 -0.533753 -0.533725 -0.082810 -0.246632 -0.125366 0.005668 0.544149 -0.213777 -0.064593 0.012947 0.321060 0.113076 -0.069760 -0.104762 -0.046692 0.018865 0.018133 0.134146
polarizability: 4.01130485e+02 -2.87856081e+00 2.02904938e+02 -4.90945671e-02 6.14519274e-02 9.08143268e+01
1716.lowfreq: -0.0017 -0.0017 -0.0016 2.5057 6.6797 7.6697 18.9031 34.2279 44.3911
frequency: 18.0387 34.2132 44.3646 45.0795 89.0523 117.3977 122.4234 139.7382 167.1100 204.4334 220.9144 262.6945 275.1141 287.3824 297.1483 336.3667 363.4810 379.2302 399.8813 425.0787 465.0942 478.5205 507.7063 520.8647 574.2610 579.1869 594.0254 598.0959 602.5175 631.2338 645.5629 655.0613 692.2471 739.0260 744.2486 764.3435 788.3315 794.1773 799.8935 861.9067 903.6338 912.9654 919.2968 928.7506 964.0933 998.9754 1000.5841 1014.5837 1037.9706 1058.2024 1068.2751 1098.5819 1124.6582 1166.7968 1179.5937 1215.2210 1236.7268 1283.1259 1294.8144 1307.7462 1342.3739 1395.0543 1436.1447 1472.8180 1526.5650 1541.0121 1564.6362 1573.5760 1604.4126 1630.5215 1640.7375 3074.5779 3138.2581 3140.4202 3155.5346 3168.9777 3177.5405 3241.7828 3272.4280 3388.1724 3510.5708
redmass: 7.7451 8.6440 7.4116 8.2435 6.3360 9.8094 4.8371 4.5957 5.4168 6.6868 3.0664 8.3647 7.1956 4.9655 9.4107 4.4559 7.7276 8.1009 3.2819 3.2644 7.5381 8.5148 7.9938 2.8158 1.4695 7.1807 1.7607 1.3721 4.8120 6.1354 1.3480 6.1263 3.2377 1.8228 5.3864 2.8423 4.7886 1.6045 9.9261 4.2398 1.4735 1.3756 9.4535 2.2291 1.5047 1.3754 5.8736 1.3574 1.1505 2.0740 4.3483 3.0091 1.6222 1.6078 1.0711 1.5965 1.6844 1.7951 2.1319 2.6167 1.8705 4.8966 2.4136 2.4501 1.9499 5.0711 8.2089 5.1395 6.0866 7.5499 7.3347 1.0899 1.0922 1.0866 1.0904 1.0943 1.1001 1.1047 1.0990 1.0753 1.0637
irintensity: 5.5005 0.2321 4.1648 0.6216 0.8932 1.1018 0.0182 0.1519 2.6168 2.9490 28.3785 1.4588 21.8314 2.7376 26.6342 2.5786 25.7008 23.1637 0.6611 10.7689 2.8660 10.6006 23.9808 0.0024 11.8428 2.5040 16.0971 160.9183 35.9639 4.1403 0.0507 27.3139 94.5882 103.4253 20.9369 25.9163 22.3720 35.2919 156.2405 4.1991 3.1994 1.2069 114.1208 2.2863 37.6418 6.2170 161.7177 0.2471 11.8063 17.4986 131.2113 95.1860 10.2722 106.9599 1.2081 40.8499 20.6444 15.0353 56.0915 40.9015 108.0667 41.8653 11.0349 37.6624 66.6432 4.7430 216.0753 0.4372 175.7279 416.4441 138.5307 51.5656 4.0966 1.7337 5.7432 1.9983 19.7030 7.6546 17.5751 4.1519 44.2541
temp: 298.150 k
press: 1.00000 atm
elementType: 16 8 8 8 8 7 7 6 6 6 6 6 6 6 6 6 6 6 6 1 1 1 1 1 1 1 1 1 1
symmnumber: 1
zpe: 526214.3 jmol-1
zpe.correction: 0.200424 hartree
zpe.thermalcorrener: 0.218168 hartree
zpe.thermalcorrenthalpy: 0.219112 hartree
zpe.thermalcorrgfe: 0.152502 hartree
zpe.sumelectzpe: -1270.139061 hartree
zpe.sumelectthermal: -1270.121317 hartree
zpe.sumelectthermalent: -1270.120373 hartree
zpe.sumelectthermalfe: -1270.186983 hartree
dipole: -5.5584 -5.1503 -0.0676
dipole: 7.5780
quadrupole: -162.2650 -92.4440 -129.9314
quadrupole: -30.1980 -0.1951 0.1536
quadrupole: -34.0516 35.7694 -1.7179 -30.1980 -0.1951 0.1536
hfenergy: -1270.3394851 hartree
pointgroup: C01 [X(C12H10N2O4S1)]
dipole: 2.077568 2.1320782 -0.163713 debye
polarizability: 400.8805511|7.4032292|202.7412908|-1.9414489|-6.744411|91.2279084 unknown
InChI: InChI=1S/C12H10N2O4S/c15-12(16)11-4-2-1-3-9(11)7-13-14-10-5-6-19(17,18)8-10/h1-8,14-15H
charge 0 multiplicity 1
29 atoms
S  -4.891652 -0.724012 0.040604
O  -5.488388 -1.20193 1.485419
O  -5.50186 -1.397207 -1.318188
O  3.016965 2.547014 -0.196194
O  5.217448 1.869606 -0.158979
N  -1.277887 1.044543 -0.096954
N  -0.247781 0.132352 -0.043181
C  -2.596205 0.607177 -0.060862
C  -3.021792 -0.690556 0.02881
C  -4.9378 1.19117 -0.090031
C  -3.667177 1.648397 -0.126216
C  2.13245 -0.298708 -0.028975
C  3.503732 0.137111 -0.056408
C  1.876581 -1.70141 0.051703
C  0.982737 0.61728 -0.0799
C  4.54487 -0.834438 -0.001944
C  2.916599 -2.642316 0.104167
C  4.265604 -2.208298 0.077368
C  4.005564 1.541488 -0.138575
H  -2.479558 -1.628826 0.089568
H  -5.906915 1.687093 -0.119059
H  -3.41365 2.712679 -0.199201
H  -1.084904 2.055106 -0.165495
H  0.832399 -2.025734 0.071141
H  1.190117 1.695463 -0.148122
H  5.577107 -0.471956 -0.024138
H  2.682351 -3.710481 0.165648
H  5.084321 -2.9337 0.117721
H  3.485221 3.424394 -0.247825
