program: Gaussian 09
title: 000260458
version: EM64L-G09RevD.01
frameworkgroup: C1[X(C14H11N3O2S)]
method: RPBEPBE
basis: SDD
operation: Freq
keyword: #p
keyword: freq=noraman
keyword: PBEPBE/SDD
title: #p freq=noraman PBEPBE/SDD
converged: YES YES NO NO
title: Mulliken charges:
elementType: S O O N N N C C C C C C C C C C C C C C H H H H H H H H H H H
charge: 0.852049 -0.534682 -0.534680 -0.413400 -0.004507 0.090581 0.540891 -0.511386 -0.354830 -0.242262 0.418259 -0.089155 0.172779 -0.307891 -0.385188 -0.323379 -0.308914 -0.243202 -0.218904 -0.404288 0.320375 0.288089 0.254288 0.247167 0.278549 0.236477 0.225614 0.271538 0.233852 0.237055 0.209103
chargesum: 0.00000
title: Mulliken charges with hydrogens summed into heavy atoms:
elementType: S O O N N N C C C C C C C C C C C C C C
charge: 0.852049 -0.534682 -0.534680 -0.134850 -0.004507 0.090581 0.540891 -0.191011 -0.066741 0.012027 0.418259 -0.089155 0.172779 -0.060724 -0.148711 -0.097765 -0.037376 -0.009350 0.018151 -0.195184
polarizability: 4.44103849e+02 7.26239749e+00 2.38543065e+02 2.54651226e-02 -2.05590097e-02 9.79067478e+01
1716.lowfreq: -5.2028 -3.6755 -0.0011 -0.0009 0.0014 2.8753 23.5283 29.6194 38.3918
frequency: 23.3383 29.5939 38.2620 68.5356 119.1008 121.1198 144.4290 169.8966 190.6440 210.2071 226.4634 260.4799 290.9673 309.0201 333.5523 352.2900 398.0768 408.5364 420.8833 449.2640 476.8879 481.0694 515.0240 539.3646 553.0222 573.8180 574.7117 597.5440 622.8191 650.6865 656.2316 685.6668 736.0750 743.7882 765.1315 765.1768 797.5834 798.9702 806.8145 838.0291 886.5673 903.9601 904.9208 919.7946 920.3856 926.2168 965.6250 976.9012 984.7659 999.9870 1015.8201 1038.4141 1063.6391 1114.0103 1125.3962 1151.2715 1167.5074 1204.2139 1222.8088 1243.7957 1253.5078 1297.9135 1303.5715 1354.7641 1367.4958 1404.0645 1418.3734 1457.8335 1499.4307 1526.6440 1537.2963 1561.8332 1574.0207 1595.9401 1624.1023 1640.1424 2969.9340 3123.7906 3126.7141 3136.8108 3140.6768 3150.9380 3158.2950 3174.2715 3241.3911 3266.5942 3372.6530
redmass: 5.3479 8.0591 6.2451 7.7407 7.3022 7.1102 4.7868 4.0214 3.8937 7.8551 3.6150 7.9065 8.4111 5.1498 6.5807 4.7535 3.3744 3.3795 4.8037 8.2183 2.9587 9.1293 7.1487 3.1162 7.7022 6.7423 1.4598 1.9464 7.1049 6.3230 1.2872 3.0156 5.4706 1.7894 1.3404 5.2146 10.3694 3.2331 4.7016 1.4234 1.6581 1.4691 3.9264 9.0779 3.0399 1.5751 1.3541 3.7234 1.3905 1.3364 2.1470 1.1537 7.3625 1.7270 1.5994 1.2046 1.1077 1.7968 1.5880 2.3941 1.7270 2.2954 2.7621 3.1162 1.8928 4.6396 2.2742 3.0185 3.2837 2.7371 3.6000 6.9452 5.3026 6.3707 6.5637 7.1990 1.0865 1.0874 1.0872 1.0921 1.0896 1.0985 1.0951 1.0991 1.1046 1.0993 1.0750
irintensity: 0.4938 1.4994 2.3394 1.0290 1.7096 0.0032 0.2306 15.4765 3.7436 2.0355 12.0369 12.8333 13.0765 4.0679 58.8640 0.3113 0.0428 1.1297 12.0964 18.1437 10.5444 15.4212 0.3095 0.2730 15.5752 7.9604 20.2862 79.0394 1.3118 13.0209 0.1265 0.0235 2.1110 100.4192 58.0183 51.2094 72.8561 1.1876 91.9660 66.0673 0.4971 3.2728 5.2844 100.7002 1.2250 61.6018 4.0098 2.7646 1.2264 0.1361 7.4833 12.2626 222.7959 10.2564 13.7781 2.0600 4.7776 14.3876 25.8526 6.0968 4.8168 103.3699 8.0821 1.9624 9.4359 6.9005 15.0858 5.5857 44.2060 122.3956 9.7217 161.4515 71.7054 0.8044 5.0607 256.2521 60.0239 6.1424 7.1770 4.9561 10.6317 24.6567 27.8316 19.5863 7.2027 15.8115 4.1464
temp: 298.150 k
press: 1.00000 atm
elementType: 16 8 8 7 7 7 6 6 6 6 6 6 6 6 6 6 6 6 6 6 1 1 1 1 1 1 1 1 1 1 1
symmnumber: 1
zpe: 578741.8 jmol-1
zpe.correction: 0.220431 hartree
zpe.thermalcorrener: 0.237801 hartree
zpe.thermalcorrenthalpy: 0.238746 hartree
zpe.thermalcorrgfe: 0.173411 hartree
zpe.sumelectzpe: -1251.206294 hartree
zpe.sumelectthermal: -1251.188924 hartree
zpe.sumelectthermalent: -1251.187980 hartree
zpe.sumelectthermalfe: -1251.253314 hartree
dipole: 6.9702 -8.8204 0.0051
dipole: 11.2420
quadrupole: -120.3084 -104.7171 -137.6171
quadrupole: 32.5162 -0.0084 -0.0174
quadrupole: 0.5725 16.1638 -16.7362 32.5162 -0.0084 -0.0174
hfenergy: -1251.4267252 hartree
pointgroup: C01 [X(C14H11N3O2S1)]
dipole: 2.6223464 3.5617242 -0.0018515 debye
polarizability: 444.3597988|-0.2388991|238.2870861|-0.1078945|0.0103122|97.9067771 unknown
InChI: InChI=1S/C14H11N3O2S/c18-20(19)8-7-13(10-20)17-15-9-12-6-5-11-3-1-2-4-14(11)16-12/h1-10,17H
charge 0 multiplicity 1
31 atoms
S  -5.091326 -1.255961 0.00132
O  -5.49633 -1.986046 -1.404479
O  -5.497586 -1.985172 1.407211
N  -2.17651 1.517534 0.001783
N  1.722624 -0.099862 0.001123
N  -0.930261 0.934781 0.002384
C  -3.307756 0.70756 0.001518
C  -3.31839 -0.660308 0.001921
C  -5.715362 0.561115 0.000483
C  -4.641912 1.381493 0.000728
C  4.169119 0.372108 -0.000894
C  3.034684 -0.536516 0.000144
C  1.495525 1.237038 0.001192
C  3.884965 1.776775 -0.000823
C  5.496405 -0.162544 -0.00193
C  2.561602 2.209694 0.000177
C  3.275428 -1.950303 0.000093
C  5.699607 -1.545022 -0.001945
C  4.581953 -2.442537 -0.000934
C  0.113409 1.739231 0.002358
H  -2.511871 -1.387719 0.002499
H  -6.789462 0.741019 -0.000053
H  -4.720603 2.475254 0.000366
H  4.711045 2.497133 -0.001578
H  -2.292096 2.542896 0.001405
H  6.350358 0.525683 -0.002709
H  2.32049 3.278485 0.000248
H  2.404191 -2.612067 0.000874
H  6.716896 -1.951209 -0.002739
H  4.760182 -3.523276 -0.000972
H  0.003278 2.843343 0.00143
