program: Gaussian 09
title: 000260456
version: EM64L-G09RevD.01
frameworkgroup: C1[X(C11H8Cl2N2O2S)]
method: RPBEPBE
basis: SDD
operation: Freq
keyword: #p
keyword: freq=noraman
keyword: PBEPBE/SDD
title: #p freq=noraman PBEPBE/SDD
converged: NO NO NO NO
title: Mulliken charges:
elementType: Cl Cl S O O N N C C C C C C C C C C C H H H H H H H H
charge: -0.034780 -0.039926 0.855350 -0.530691 -0.530694 -0.415877 0.019900 0.547977 -0.515588 -0.352202 -0.242323 0.490272 -0.375156 -0.371834 -0.340706 -0.068233 -0.064061 -0.225823 0.308663 0.289911 0.255351 0.286583 0.256624 0.293793 0.215468 0.288002
chargesum: 0.00000
title: Mulliken charges with hydrogens summed into heavy atoms:
elementType: Cl Cl S O O N N C C C C C C C C C C C
charge: -0.034780 -0.039926 0.855350 -0.530691 -0.530694 -0.129295 0.019900 0.547977 -0.206925 -0.062290 0.013027 0.490272 -0.159688 -0.115209 -0.046912 -0.068233 -0.064061 0.062179
polarizability: 3.88920272e+02 -2.04649026e+01 2.04843260e+02 8.39001572e-03 4.08181545e-03 8.88101260e+01
1716.lowfreq: -8.5021 -3.9602 -3.5473 0.0021 0.0025 0.0026 13.5026 31.1623 33.9748
frequency: 13.0304 31.1616 33.9462 75.7966 105.6407 128.0732 144.3665 157.6310 168.5119 193.6402 228.1450 238.9616 246.4183 285.3147 285.7188 323.6060 338.5434 374.3679 398.8036 408.6831 426.2455 462.4758 482.5767 515.3205 553.0352 566.6126 571.8999 594.2128 639.2665 649.5955 676.9855 678.5198 741.0647 756.2570 790.5893 803.5763 858.9711 868.8898 902.1590 903.9025 905.1317 925.3110 934.3888 945.8382 979.6543 1037.0370 1078.0246 1096.4517 1105.8096 1124.0433 1216.2114 1239.3204 1256.5201 1297.1757 1339.4378 1384.2476 1410.1557 1438.5202 1530.0660 1549.3005 1564.3664 1581.2107 1598.7333 1642.8938 2990.2592 3137.2773 3159.4996 3185.6638 3190.3921 3243.6980 3270.9261 3393.5603
redmass: 11.3112 12.9047 7.6435 9.1542 11.7131 7.6530 5.5465 16.6657 5.3149 4.0778 10.1737 2.9906 9.4546 8.2207 4.9925 8.5103 4.5547 14.1532 3.3055 8.8938 5.1990 9.2256 8.0502 5.2794 1.9870 7.3036 2.1521 2.0258 6.2937 1.3235 2.2504 6.2217 1.8206 11.1534 4.4652 10.5869 1.5174 1.3975 3.1676 1.4285 1.3860 11.4881 1.6365 2.9879 5.6126 1.1525 4.7793 1.6493 1.8081 1.6598 1.6523 1.8748 1.2728 2.2445 1.8778 5.6257 3.0478 3.4006 1.8098 7.0561 7.3064 5.8354 7.2961 7.1532 1.0875 1.0921 1.0927 1.0929 1.0940 1.1047 1.0993 1.0753
irintensity: 3.7754 2.3603 0.0884 0.0739 0.3559 0.0753 0.3749 2.3695 3.2373 3.7025 1.6900 23.5959 4.2719 10.4866 1.6706 71.1686 2.3687 2.1057 0.2765 4.8071 9.4176 14.0297 12.7837 0.0157 17.3662 6.0291 13.6900 74.2426 5.7220 0.0673 26.1098 69.5452 102.9844 100.7384 16.5400 142.7681 29.5319 0.7224 23.4501 0.5235 1.5044 103.7710 67.5238 45.1309 1.7034 7.6870 100.1909 21.1594 49.0597 9.2580 22.5341 69.6603 9.6709 121.6578 28.7909 0.9921 40.7736 28.7910 112.7641 97.0344 119.4509 101.5749 36.8699 256.0901 47.9978 4.2227 0.9341 1.9673 3.9863 8.1672 16.3974 3.8983
temp: 298.150 k
press: 1.00000 atm
elementType: 17 17 16 8 8 7 7 6 6 6 6 6 6 6 6 6 6 6 1 1 1 1 1 1 1 1
symmnumber: 1
zpe: 438871.8 jmol-1
zpe.correction: 0.167157 hartree
zpe.thermalcorrener: 0.184668 hartree
zpe.thermalcorrenthalpy: 0.185612 hartree
zpe.thermalcorrgfe: 0.118837 hartree
zpe.sumelectzpe: -2000.565346 hartree
zpe.sumelectthermal: -2000.547836 hartree
zpe.sumelectthermalent: -2000.546891 hartree
zpe.sumelectthermalfe: -2000.613666 hartree
dipole: 3.7811 -8.2169 -0.0010
dipole: 9.0451
quadrupole: -160.2486 -113.7187 -137.8829
quadrupole: 30.3023 0.0010 -0.0014
quadrupole: -22.9652 23.5647 -0.5995 30.3023 0.0010 -0.0014
hfenergy: -2000.7325038 hartree
pointgroup: C01 [X(C11H8Cl2N2O2S1)]
dipole: 1.4161799 3.2646693 0.003171 debye
dipolederiv: -0.1315644 0.0186041 0.0000621 0.2060083 -0.7868448 -0.0007233 0.000237 -0.0006953 -0.0550977 -0.7547181 -0.3134202 0.0001085 -0.3792158 -0.3154367 -0.0000177 0.0001412 -0.0000081 -0.0583666 1.9170593 0.3367385 0.0001584 0.4001657 1.1707897 -0.0001111 0.0004221 -0.0000869 1.2802367 -0.7213715 -0.0822745 0.0321611 -0.1459555 -0.531021 0.017462 0.1526349 0.1294372 -0.6066351 -0.7213487 -0.0821985 -0.0322125 -0.1456781 -0.5307482 -0.0173003 -0.1529405 -0.1293093 -0.6069018 -2.1161301 -0.3853539 -0.0000447 0.6565076 -0.0748243 -0.0000086 0.0005854 0.0001183 -0.2517913 1.0327587 0.0056161 0.000095 -1.0222444 -0.2745452 0.0000094 -0.0003919 -0.0002473 -0.0853853 1.4708813 0.4592785 0.0003255 1.1990749 0.35228 0.0001353 0.0011709 0.0002857 0.1114222 -0.6024984 -0.0778773 -0.0000005 -0.7191408 -0.4409913 0.000076 -0.0006492 0.0000264 -0.4413502 -0.2272322 0.1271297 0.0001701 -0.0449002 -0.0066357 0.0003205 -0.000021 0.0003472 -0.3456339 -0.068608 -0.1366469 -0.0001288 -0.0739328 -0.0086863 0.0001185 -0.0001627 0.0000533 -0.1130644 0.3878235 0.0420257 -0.0001 -0.0736899 0.0909018 0.0000311 0.0000599 0.0000712 0.0387671 -0.1531499 -0.0628182 -0.0003247 -0.4237068 0.4430526 0.0005001 -0.0017659 0.0002646 -0.1046115 -0.5543361 -0.1378474 0.0000229 -0.0075619 -0.0919799 0.000107 0.0004637 0.0001353 -0.1534261 -0.2684464 0.1014057 0.000107 0.1962181 -0.4075927 -0.0003479 0.0003578 -0.0003656 -0.1051493 0.2314069 -0.0280636 -0.0002085 -0.4210716 1.2801418 0.0013396 -0.0006145 0.0012694 -0.0399375 1.3071807 0.4552351 -0.0003495 0.6340152 0.4910958 0.0001213 -0.0004711 0.0001572 -0.0322382 -0.4497371 -0.1531074 0.0000169 -0.0174036 -0.4534823 -0.0002674 0.0002525 -0.0002406 -0.081747 -0.0243578 -0.0005336 -0.0000103 0.010021 0.1129165 -0.0001314 0.0000022 -0.0001233 0.2317118 0.1013813 0.0041562 -0.0000062 0.0456082 0.0329725 -0.0001673 0.0000527 -0.0001637 0.2078734 0.118888 -0.1166322 -0.0001264 0.0010948 -0.054366 -0.0002442 -0.0000097 -0.0002529 0.196829 -0.0118531 -0.0000147 -0.0000167 0.0797368 0.0324196 -0.0002484 0.0000511 -0.0001962 0.3246189 0.1193423 0.0293927 0.0000803 0.0189699 -0.0337204 -0.0001985 0.0000785 -0.00021 0.1700736 0.0666594 -0.060696 0.0000244 -0.0610643 0.0860714 -0.0000479 0.0000285 -0.0000422 0.1598821 -0.0082649 0.0272891 0.0000815 0.0606857 -0.1745578 -0.0003063 0.0003703 -0.0001191 0.1843894 0.0602355 0.030613 0.0001151 0.0274594 0.092791 -0.0001005 0.0001176 -0.0001051 0.1755317 unknown
polarizability: 387.9320552|24.4896438|205.8313475|-0.0636014|0.1104722|88.8102554 unknown
InChI: InChI=1S/C11H8Cl2N2O2S/c12-9-3-8(4-10(13)5-9)6-14-15-11-1-2-18(16,17)7-11/h1-7,15H
charge 0 multiplicity 1
26 atoms
Cl 3.50596 -3.336006 -0.003736
Cl 6.171038 1.533381 -0.001013
S  -4.717031 -0.870908 0.000141
O  -5.226976 -1.5281 1.404689
O  -5.226667 -1.525462 -1.405745
N  -1.392482 1.409637 0.002597
N  -0.243332 0.654949 0.002075
C  -2.635472 0.781488 0.001892
C  -2.866059 -0.565541 0.000588
C  -5.037059 1.02814 0.00191
C  -3.844134 1.660588 0.002666
C  2.180493 0.551745 0.000918
C  0.912959 1.289324 0.002582
C  3.398336 1.286589 0.000712
C  2.21339 -0.872579 -0.000502
C  3.456342 -1.518519 -0.002005
C  4.617283 0.587427 -0.000812
C  4.683989 -0.818666 -0.002202
H  -2.195576 -1.419238 -0.000203
H  -6.066852 1.381856 0.002156
H  -3.744293 2.75262 0.003737
H  -1.352315 2.439517 0.003464
H  3.391143 2.380894 0.001752
H  1.276951 -1.435113 -0.000342
H  0.979885 2.395334 0.003164
H  5.640378 -1.345961 -0.00338
