program: Gaussian 09
title: 000260479
version: EM64L-G09RevD.01
frameworkgroup: C1[X(C14H18N2O3)]
method: RPBEPBE
basis: SDD
operation: Freq
keyword: #p
keyword: freq=noraman
keyword: PBEPBE/SDD
title: #p freq=noraman PBEPBE/SDD
converged: YES YES NO NO
title: Mulliken charges:
elementType: O O O N N C C C C C C C C C C C C C C H H H H H H H H H H H H H H H H H H
charge: -0.258258 -0.464022 -0.480184 -0.193561 -0.068848 -0.121485 -0.509007 -0.095604 -0.003276 -0.416591 0.338993 -0.274892 -0.043967 -0.553921 0.382784 -0.536645 0.362521 -0.824727 -0.821728 0.241901 0.248676 0.267795 0.237884 0.251774 0.227292 0.209188 0.319116 0.364529 0.238893 0.252712 0.365543 0.229006 0.224618 0.225364 0.221682 0.234433 0.222013
chargesum: 0.00000
title: Mulliken charges with hydrogens summed into heavy atoms:
elementType: O O O N N C C C C C C C C C C C C C C
charge: -0.258258 -0.099493 -0.114641 -0.193561 -0.068848 0.120416 0.007464 0.142280 0.248498 0.019889 0.338993 0.044224 -0.043967 -0.315028 0.382784 -0.283934 0.362521 -0.145738 -0.143600
polarizability: 2.44374984e+02 1.28616918e+01 1.61467808e+02 9.31129328e+00 -1.20066607e+01 1.19356372e+02
1716.lowfreq: -0.0009 -0.0007 -0.0006 2.7321 6.7347 14.2878 30.9346 43.3186 57.3159
frequency: 30.2638 43.3109 57.3150 80.3438 114.3791 119.8646 127.7937 147.3321 147.8792 185.4199 197.9343 231.8718 268.3279 297.4132 302.4055 330.8466 333.8949 342.6953 372.1428 395.5201 432.6462 445.3135 467.2923 478.3990 502.0360 525.9804 572.4270 600.5158 625.8386 655.6832 657.9971 725.4630 763.1920 770.6588 782.6826 823.8941 838.1667 853.8816 873.2505 876.1086 894.7484 907.5864 960.3866 972.4967 987.2110 995.9369 1002.4320 1009.2026 1030.9887 1039.0834 1050.4193 1052.8960 1077.5778 1104.2633 1118.1020 1151.3817 1170.3940 1178.0181 1193.7738 1211.8880 1222.3245 1232.2813 1255.6620 1263.4600 1278.7323 1292.5004 1293.8859 1309.2355 1333.6898 1352.1578 1372.9679 1375.3279 1388.3229 1393.6767 1406.1943 1412.5692 1436.7647 1449.1151 1462.6049 1466.6985 1468.5671 1476.4954 1484.5164 1486.2451 1487.5869 1581.8720 1641.7741 2966.4659 2967.6471 2971.1374 2981.7334 2998.4660 3036.8324 3040.0529 3040.1348 3049.8299 3079.7437 3081.7253 3083.7240 3115.8280 3131.7826 3149.4747 3208.8695 3542.8554 3600.2692
redmass: 5.1930 4.6406 4.9136 4.6008 4.7021 3.1387 1.4363 2.1317 3.1097 1.3315 2.5846 1.2506 2.9651 2.9378 2.9006 3.9757 3.4957 4.0612 3.3211 3.7628 2.6695 5.5775 4.3693 1.1647 4.5864 4.5646 3.4383 4.6982 4.5227 4.2194 4.5346 5.5113 4.9722 3.7508 5.8896 2.7983 3.2440 1.4644 1.3308 3.8481 1.4602 2.2868 4.7601 4.3066 3.4161 2.2452 1.5306 1.8590 1.4376 2.5902 3.1850 1.6263 2.0439 1.7705 2.4386 1.5178 2.4628 1.4369 1.9692 1.2529 1.3934 1.4288 1.3153 1.3981 1.2419 2.7963 1.4418 1.3412 5.2586 1.4653 1.4121 1.4064 3.7221 1.2364 1.2981 1.6594 2.2914 3.0704 1.0489 2.3149 1.1665 1.0461 1.3151 1.0838 1.5336 8.3090 7.6671 1.0379 1.0378 1.0594 1.0806 1.0863 1.0970 1.1069 1.0978 1.0630 1.0984 1.0882 1.0975 1.1039 1.0919 1.0924 1.1000 1.0655 1.0670
irintensity: 0.6375 1.3854 2.8035 0.6462 5.6916 2.5598 0.2197 0.6673 4.4011 4.6554 25.8545 106.9495 10.9250 0.7324 2.6284 9.1966 0.5219 3.9916 13.3303 15.6294 10.6760 3.5327 2.2026 199.3112 8.4768 4.3221 5.6130 5.5351 9.8234 5.8132 25.9133 1.1800 23.6089 3.0215 4.9703 18.4991 2.7254 18.3734 17.7072 81.8098 23.1156 39.5366 51.2001 98.5491 9.7880 76.5981 7.0595 2.1198 15.3351 27.5115 17.3800 0.0344 4.8146 17.1601 1.4740 26.5360 1.7183 30.5906 3.0178 50.4329 63.6869 152.9742 20.8301 8.7970 1.0503 6.9820 0.8065 20.6647 56.4604 4.5396 5.2757 23.7295 4.4717 7.7521 15.9139 2.5196 12.7764 64.3386 0.0522 33.2692 15.3692 29.9204 14.4450 6.8160 22.7000 6.6899 5.0658 62.4965 35.7420 35.0521 18.8745 54.5323 42.8194 43.0257 13.9632 16.3044 33.8817 19.2773 9.5654 12.2608 16.0002 8.2936 19.4487 22.6448 8.2793
temp: 298.150 k
press: 1.00000 atm
elementType: 8 8 8 7 7 6 6 6 6 6 6 6 6 6 6 6 6 6 6 1 1 1 1 1 1 1 1 1 1 1 1 1 1 1 1 1 1
symmnumber: 1
zpe: 790605.8 jmol-1
zpe.correction: 0.301126 hartree
zpe.thermalcorrener: 0.319154 hartree
zpe.thermalcorrenthalpy: 0.320098 hartree
zpe.thermalcorrgfe: 0.254893 hartree
zpe.sumelectzpe: -878.027618 hartree
zpe.sumelectthermal: -878.009590 hartree
zpe.sumelectthermalent: -878.008646 hartree
zpe.sumelectthermalfe: -878.073851 hartree
dipole: 2.9748 -4.8441 0.2255
dipole: 5.6891
quadrupole: -85.2375 -120.0833 -106.4213
quadrupole: -5.5335 -6.5039 0.8173
quadrupole: 18.6765 -16.1693 -2.5072 -5.5335 -6.5039 0.8173
hfenergy: -878.3287443 hartree
pointgroup: C01 [X(C14H18N2O3)]
dipole: 1.3256589 1.7994395 0.1202441 debye
polarizability: 241.0862408|-18.043931|166.2755857|-15.5068815|-4.5616914|117.8373369 unknown
InChI: InChI=1S/C14H18N2O3/c1-8-3-10-11(4-9(8)2)16(7-15-10)14-5-12(18)13(6-17)19-14/h3-4,7,12-14,17-18H,5-6H2,1-2H3
charge 0 multiplicity 1
37 atoms
O  1.916158 1.315561 -0.144495
O  3.653028 -1.75828 -0.873069
O  5.031066 0.01866 1.333492
N  0.186299 -0.275009 -0.831047
N  -0.821751 -2.205826 -0.097347
C  1.221336 0.653311 -1.28254
C  2.36525 -0.031689 -2.072358
C  3.476133 -0.311643 -1.026151
C  2.946171 0.347717 0.283721
C  4.02163 1.070471 1.084178
C  -1.133628 0.081637 -0.477647
C  0.307799 -1.658483 -0.563545
C  -1.748299 -1.132381 -0.037106
C  -1.833246 1.303829 -0.500667
C  -3.185908 1.307224 -0.089738
C  -3.09893 -1.122761 0.373873
C  -3.822715 0.088959 0.347893
C  -3.968951 2.609024 -0.104226
C  -5.27685 0.108717 0.789808
H  0.730857 1.474232 -1.828067
H  2.726032 0.665721 -2.844459
H  2.053402 -0.963487 -2.569003
H  4.434969 0.154151 -1.325932
H  2.48645 -0.445931 0.908961
H  3.607608 1.466782 2.031611
H  4.449246 1.904524 0.491229
H  1.244299 -2.192375 -0.724527
H  4.319394 -1.89548 -0.150011
H  -1.355106 2.240388 -0.808596
H  -3.572042 -2.051377 0.709476
H  5.726941 0.351851 1.95041
H  -3.346046 3.447542 -0.459718
H  -4.855755 2.54393 -0.764112
H  -4.34391 2.871687 0.903982
H  -5.946828 0.462016 -0.017945
H  -5.612903 -0.898684 1.088006
H  -5.434899 0.785371 1.652164
