program: Gaussian 09
title: 000260445
version: EM64L-G09RevD.01
frameworkgroup: C1[X(C10H13ClN2O)]
method: RPBEPBE
basis: SDD
operation: Freq
keyword: #p
keyword: freq=noraman
keyword: PBEPBE/SDD
title: #p freq=noraman PBEPBE/SDD
converged: YES YES NO NO
title: Mulliken charges:
elementType: Cl O N N C C C C C C C C C C H H H H H H H H H H H H H
charge: -0.086003 -0.300235 -0.492518 -0.415276 0.309505 0.274798 -0.338734 -0.385191 -0.326737 -0.848402 0.290461 -0.233745 -0.253508 -0.550862 0.313701 0.305920 0.244099 0.270368 0.225846 0.226213 0.226696 0.247395 0.296430 0.225223 0.225575 0.281021 0.267961
chargesum: 0.00000
title: Mulliken charges with hydrogens summed into heavy atoms:
elementType: Cl O N N C C C C C C C C C C
charge: -0.086003 -0.300235 -0.178817 -0.118845 0.309505 0.274798 -0.032814 -0.159345 0.187730 -0.148098 0.290461 -0.008522 -0.027933 -0.001880
polarizability: 1.97321414e+02 3.86514116e+00 1.44231661e+02 1.20602007e+01 5.51414468e+00 7.17202874e+01
1716.lowfreq: -2.1692 -0.0015 -0.0014 0.0012 6.4951 9.1721 19.1117 42.1590 63.2249
frequency: 18.4866 41.7320 63.2212 66.8538 106.4374 127.2430 171.2483 198.4030 220.7980 276.0082 279.3359 284.1854 368.6254 396.9572 420.4097 443.6232 472.2986 528.1067 541.6409 585.1785 599.3472 611.3561 704.2820 708.5075 726.9955 764.7609 771.5455 827.9701 858.3134 879.7445 950.1200 960.6604 978.8253 987.0171 993.9538 1039.9905 1041.6654 1047.0925 1108.1938 1134.7942 1169.1497 1173.3467 1195.7775 1213.6190 1238.0945 1274.8938 1297.5684 1301.7222 1367.2548 1378.1693 1394.9591 1438.6535 1440.3927 1444.2955 1454.6247 1480.9452 1483.8473 1492.7416 1523.3051 1596.3679 1620.3337 1643.8892 2948.8136 2993.3631 3016.3162 3051.6924 3065.7669 3086.2080 3120.9532 3135.7571 3154.9085 3160.1955 3192.3292 3535.6365 3545.7597
redmass: 5.7389 5.9691 6.7050 4.6757 3.4977 4.8567 2.9986 1.0864 4.3508 3.8055 3.0260 3.8351 3.1417 1.4375 3.1257 2.9644 2.6504 4.9268 2.8308 3.4346 1.5343 4.5494 9.0535 4.8777 2.9854 1.3332 3.9712 3.9780 2.4221 1.3037 1.3663 2.3117 1.6231 2.5844 1.3026 1.9097 1.5237 2.1211 2.2546 2.1340 1.4235 1.1222 1.8428 1.5782 1.5146 2.0277 1.2484 1.6033 1.5795 3.0804 1.2850 1.1667 1.8841 1.2363 1.6573 1.0634 1.4584 1.7234 2.1523 6.0897 5.8193 4.0274 1.0401 1.0597 1.0978 1.0963 1.0624 1.0942 1.0870 1.0900 1.1120 1.0985 1.0948 1.0763 1.0763
irintensity: 0.8904 0.7640 11.7263 1.7579 6.3777 5.5625 0.4790 0.7336 4.3477 1.4236 4.4475 2.7719 30.3312 13.6474 1.1598 9.0450 8.9624 3.0405 34.7714 29.4081 137.9935 21.5240 6.4969 13.8084 2.8300 94.9132 4.8076 0.5060 17.4547 3.5936 4.0458 17.1408 2.1536 5.9423 2.4289 2.2602 6.6922 16.7045 9.4567 0.9961 9.2376 3.4705 32.4768 66.7342 280.2943 14.8997 19.0329 91.6488 24.8902 44.4903 23.7958 20.8436 40.9771 46.8748 37.9674 33.7858 401.4599 12.9417 502.0266 85.5045 6.7492 123.4560 36.4472 57.1605 25.3537 6.7700 22.7876 17.2955 8.4981 20.8488 16.8460 28.5533 9.5383 17.5408 33.0648
temp: 298.150 k
press: 1.00000 atm
elementType: 17 8 7 7 6 6 6 6 6 6 6 6 6 6 1 1 1 1 1 1 1 1 1 1 1 1 1
symmnumber: 1
zpe: 567852.8 jmol-1
zpe.correction: 0.216284 hartree
zpe.thermalcorrener: 0.230494 hartree
zpe.thermalcorrenthalpy: 0.231438 hartree
zpe.thermalcorrgfe: 0.172982 hartree
zpe.sumelectzpe: -1032.636135 hartree
zpe.sumelectthermal: -1032.621925 hartree
zpe.sumelectthermalent: -1032.620980 hartree
zpe.sumelectthermalfe: -1032.679437 hartree
dipole: 0.7214 2.2180 0.5627
dipole: 2.3993
quadrupole: -87.1442 -87.7029 -93.1580
quadrupole: -9.9137 2.7230 3.3394
quadrupole: 2.1908 1.6322 -3.8230 -9.9137 2.7230 3.3394
hfenergy: -1032.8524186 hartree
pointgroup: C01 [X(C10H13Cl1N2O1)]
dipole: 0.2059998 -0.9080565 -0.1550225 debye
polarizability: 196.3481318|-9.3269671|145.8993881|-10.0845765|1.1459762|71.0258422 unknown
InChI: InChI=1S/C10H13ClN2O/c1-8-4-2-3-5-9(8)13-10(14)12-7-6-11/h2-5,12-13H,6-7H2,1H3
charge 0 multiplicity 1
27 atoms
Cl 5.025201 -1.627867 0.575781
O  1.130243 1.734744 -0.361388
N  0.041993 -0.370371 -0.307022
N  2.36171 -0.237639 -0.581004
C  -1.318436 -0.000317 -0.100372
C  -2.279977 -1.059305 -0.027368
C  -1.729838 1.352161 0.031819
C  -3.636889 -0.721613 0.179458
C  3.635727 0.469618 -0.695968
C  -1.86147 -2.51454 -0.168537
C  1.162763 0.466976 -0.40897
C  -3.09251 1.65206 0.23871
C  -4.055086 0.621617 0.314084
C  4.56783 0.220097 0.489708
H  0.20773 -1.37356 -0.402203
H  -0.979486 2.142005 -0.032103
H  4.148898 0.198634 -1.638103
H  3.39235 1.548956 -0.733562
H  -4.376488 -1.52958 0.23583
H  -1.394608 -2.724344 -1.153083
H  -1.145511 -2.824989 0.620157
H  -2.736719 -3.179236 -0.083438
H  2.399617 -1.257237 -0.525707
H  -3.397843 2.699591 0.33964
H  -5.112763 0.856098 0.474151
H  4.091327 0.442768 1.454969
H  5.528138 0.745976 0.38282
