program: Gaussian 09
title: 000260436
version: EM64L-G09RevD.01
frameworkgroup: C1[X(C10H11BrO)]
method: RPBEPBE
basis: SDD
operation: Freq
keyword: #p
keyword: freq=noraman
keyword: PBEPBE/SDD
title: #p freq=noraman PBEPBE/SDD
converged: YES YES NO NO
title: Mulliken charges:
elementType: Br O C C C C C C C C C C H H H H H H H H H H H
charge: -0.006532 -0.211564 -0.555246 -0.493682 0.504667 0.236694 -0.348790 -0.423310 -0.191918 -0.211611 -0.766566 -0.213220 0.230885 0.240363 0.243526 0.251124 0.254276 0.241579 0.233256 0.258232 0.233306 0.242259 0.252273
chargesum: 0.00000
title: Mulliken charges with hydrogens summed into heavy atoms:
elementType: Br O C C C C C C C C C C
charge: -0.006532 -0.211564 -0.083999 0.000968 0.504667 0.236694 -0.094514 -0.181731 -0.191918 0.021645 -0.032769 0.039053
polarizability: 1.66757872e+02 1.02851482e+01 1.26210268e+02 -1.02266785e+01 5.92136277e+00 7.71678564e+01
1716.lowfreq: -9.7474 -6.2721 -0.0005 0.0001 0.0002 4.5431 13.0052 27.6319 67.7704
frequency: 10.8339 27.6064 67.7474 74.1621 92.4044 158.7337 163.9317 200.7638 248.1784 294.5689 356.2426 381.3971 439.8767 464.2047 514.1144 564.0486 600.6075 655.9321 696.5128 741.9169 785.7496 811.9845 853.3904 899.2068 909.4403 913.2239 950.6460 981.7269 982.6741 1031.6727 1052.5378 1066.0072 1096.3305 1149.5491 1168.4519 1179.0331 1213.8389 1263.2790 1280.1921 1296.9235 1346.8955 1369.4743 1372.6535 1416.2985 1430.6188 1442.8574 1455.9063 1462.1053 1472.4567 1569.7776 1603.3406 1635.1034 2966.0384 2981.2691 3010.0445 3013.9283 3067.8999 3073.4577 3120.2062 3127.7322 3145.8990 3150.3720 3174.9858
redmass: 3.9361 6.7838 3.8671 1.3833 1.4665 5.2012 5.2844 4.4569 4.5906 8.8529 2.7751 2.8994 3.0588 2.0553 4.9417 4.7706 4.8159 6.8190 2.3104 1.2791 1.4636 4.3498 2.3819 1.4984 1.4872 1.4261 2.0983 1.4806 4.1916 1.6903 3.3630 2.2105 1.5879 1.2984 2.0624 1.0878 2.1144 1.2421 1.5420 1.3100 1.6842 1.2360 7.8868 2.5042 1.0882 1.0667 1.0586 2.4688 1.0958 6.3974 6.7312 7.7683 1.0606 1.0388 1.0699 1.0878 1.0948 1.1018 1.1007 1.0877 1.0923 1.0935 1.0973
irintensity: 2.2996 5.1136 1.0692 0.5333 0.3032 3.7458 1.0846 4.0804 0.3690 4.6544 0.4153 1.3991 9.9688 1.1922 11.8049 0.5807 1.1004 21.3241 27.9271 1.7594 49.3103 24.5653 8.7032 8.2976 10.3952 0.1900 9.8357 1.2129 6.6159 2.0649 10.5383 20.1149 1.9736 1.9457 55.6184 0.5601 13.3447 14.0312 54.4098 8.7704 37.9063 58.7881 1.4563 20.9723 22.5188 21.3475 17.3825 42.8129 10.9290 58.3040 42.4839 111.4188 12.0902 5.3109 14.3008 6.5218 11.3317 16.6230 14.7115 6.8399 8.9340 11.0810 7.6113
temp: 298.150 k
press: 1.00000 atm
elementType: 35 8 6 6 6 6 6 6 6 6 6 6 1 1 1 1 1 1 1 1 1 1 1
symmnumber: 1
zpe: 472817.8 jmol-1
zpe.correction: 0.180087 hartree
zpe.thermalcorrener: 0.192684 hartree
zpe.thermalcorrenthalpy: 0.193628 hartree
zpe.thermalcorrgfe: 0.136887 hartree
zpe.sumelectzpe: -475.464354 hartree
zpe.sumelectthermal: -475.451757 hartree
zpe.sumelectthermalent: -475.450813 hartree
zpe.sumelectthermalfe: -475.507554 hartree
dipole: 0.6831 0.2949 2.6109
dipole: 2.7148
quadrupole: -90.7348 -72.1714 -84.0426
quadrupole: -7.0130 10.4359 1.8758
quadrupole: -8.4185 10.1449 -1.7264 -7.0130 10.4359 1.8758
hfenergy: -475.6444411 hartree
pointgroup: C01 [X(C10H11Br1O1)]
dipole: 0.2342154 -0.3707129 -0.9739294 debye
dipolederiv: -0.3215351 0.2848131 -0.0547322 0.3556803 -0.5100541 0.0707705 -0.0684964 0.0694288 -0.0658911 -0.7378365 0.0005294 -0.1147195 -0.0050831 -0.3310302 0.1429339 -0.1386475 0.1447646 -0.7869477 -0.078719 -0.0402787 0.0162126 -0.0071024 0.090483 0.0255219 0.1210877 0.013851 0.0859091 -0.5618388 -0.0647521 -0.0877272 -0.0877151 0.1349744 0.0226742 -0.3369052 0.0179917 -0.0506633 0.4579832 0.0624703 0.0549205 -0.0242816 0.0818651 -0.0097226 0.0835458 0.0193024 -0.0459568 1.2617233 0.1438231 0.0225651 0.1625342 0.199182 -0.2808084 0.1278329 -0.271099 0.9111025 -0.3833196 0.1372831 -0.029505 0.3177928 -0.2006494 0.0749197 -0.0400616 0.0367631 -0.1141734 -0.2203798 -0.0485795 0.0235386 -0.1408593 -0.0037612 -0.0250331 -0.0013569 -0.0113531 -0.1555244 0.5327643 -0.5315549 0.1413427 -0.6488268 0.9053311 -0.1274757 0.1636486 -0.1225903 -0.0664297 0.106662 -0.0592539 0.0587014 0.0525974 0.1150673 0.0168912 0.0675737 -0.0141587 -0.1109665 -0.3207827 -0.1145351 0.2123417 -0.1658261 -0.0744611 0.1996878 0.2066929 0.1468303 -0.2390657 -0.1445889 0.1864081 0.0229258 0.1344602 -0.3676371 0.0280001 -0.0026997 0.0441867 -0.1166657 0.0397579 -0.0007604 -0.0119997 -0.0274549 -0.0315054 -0.1096219 -0.0058323 -0.0694706 -0.0019693 0.0506239 0.0306308 -0.0301608 0.0442868 -0.0516468 0.0824447 -0.0050295 0.0504654 0.040964 0.0695885 0.0289594 -0.0196534 0.0323583 -0.0447734 0.1063321 0.0341048 0.0741087 0.0322474 0.0822739 -0.0092439 0.0013027 0.0042048 0.0011283 -0.1092062 0.030989 -0.067971 -0.0065612 0.0816259 -0.0693424 -0.0296336 -0.0758655 -0.0180875 -0.0213493 -0.033621 -0.0220106 0.1336873 0.0267585 0.1106174 -0.0416286 0.0956658 -0.0277917 0.0182441 -0.0419817 0.0274768 0.1355447 0.0381758 -0.0559281 -0.0306678 -0.0662167 -0.0921832 -0.0205477 -0.0373481 -0.0196796 0.1481094 -0.1169214 0.03333 0.0024624 0.0521119 0.1122297 0.0050473 -0.0277378 0.0272626 0.0790988 0.0751381 -0.057711 -0.0708115 -0.015658 0.0850041 -0.0984312 -0.0490451 -0.0576687 -0.0589365 0.1051721 0.0469454 0.0234486 0.0169265 -0.0749986 0.0114337 0.0137276 -0.0106982 0.1032167 -0.0423254 -0.01387 -0.0585228 -0.0037295 0.1033147 -0.0027051 -0.0604403 -0.0057322 0.1498714 unknown
polarizability: 160.33183|-15.5285232|131.9074311|14.4454619|-7.4020595|77.8967353 unknown
InChI: InChI=1S/C10H11BrO/c1-8(12)5-6-9-3-2-4-10(11)7-9/h2-4,7H,5-6H2,1H3
charge 0 multiplicity 1
23 atoms
Br -3.667529 2.248578 -0.447637
O  3.869645 -0.187653 1.027351
C  1.033329 -0.238148 0.79632
C  1.927397 0.020349 -0.440699
C  -0.431384 -0.382255 0.412955
C  3.420364 0.114396 -0.110064
C  -1.232992 0.773077 0.212491
C  -1.016294 -1.658947 0.214608
C  -2.577298 0.630179 -0.180198
C  -2.36775 -1.782464 -0.177955
C  4.333602 0.604224 -1.229113
C  -3.167602 -0.633834 -0.3822
H  1.171305 0.593791 1.511416
H  1.395512 -1.147277 1.307823
H  1.617486 0.943779 -0.971124
H  1.797352 -0.795618 -1.183183
H  -0.808066 1.769781 0.372797
H  -0.411202 -2.558729 0.377185
H  -2.810364 -2.773935 -0.322964
H  5.379031 0.330073 -1.017608
H  4.025947 0.203754 -2.211707
H  4.270842 1.708572 -1.29349
H  -4.215131 -0.722896 -0.683205
