program: Gaussian 09
title: 000260447
version: EM64L-G09RevD.01
frameworkgroup: C1[X(C11H21ClN2O)]
method: RPBEPBE
basis: SDD
operation: Freq
keyword: #p
keyword: freq=noraman
keyword: PBEPBE/SDD
title: #p freq=noraman PBEPBE/SDD
converged: YES YES NO NO
title: Mulliken charges:
elementType: Cl O N N C C C C C C C C C C C H H H H H H H H H H H H H H H H H H H H H
charge: -0.091468 -0.320540 -0.421704 -0.405764 -0.057196 -0.415030 -0.408761 -0.371372 -0.428861 -0.418353 -0.388333 -0.367447 0.298554 -0.334157 -0.548202 0.256694 0.244870 0.186322 0.208187 0.201355 0.190921 0.198215 0.175502 0.209516 0.199355 0.195043 0.197718 0.204720 0.194294 0.193069 0.279451 0.292335 0.267310 0.239036 0.264052 0.280667
chargesum: 0.00000
title: Mulliken charges with hydrogens summed into heavy atoms:
elementType: Cl O N N C C C C C C C C C C C
charge: -0.091468 -0.320540 -0.142254 -0.113428 0.199499 0.016161 0.000781 0.017764 -0.043843 -0.023954 0.014105 0.019916 0.298554 0.172189 -0.003483
polarizability: 1.78228740e+02 1.56638455e+00 1.42181004e+02 -2.62705711e+00 -5.01592829e+00 1.09486558e+02
1716.lowfreq: -0.0006 0.0010 0.0014 3.7420 4.2606 16.9821 24.2286 33.5485 42.5322
frequency: 23.5785 29.4835 42.3485 62.7120 71.2479 96.7700 147.2414 169.2355 197.5849 216.4513 246.6080 253.3863 268.3261 317.9620 326.3326 357.1917 368.7950 405.5705 435.4816 452.0582 477.6753 527.5987 537.4012 578.6841 593.8637 688.1035 704.8871 710.7590 761.9715 772.0644 794.8965 841.9012 856.5166 869.5563 893.5090 954.1183 959.8079 978.1461 982.7381 1003.1956 1017.4865 1042.6826 1067.7376 1101.5880 1111.9081 1120.0104 1129.2860 1145.2700 1153.8424 1181.6186 1203.5079 1209.8919 1222.9319 1229.8809 1240.7490 1258.1078 1262.0018 1289.0807 1297.6701 1309.0483 1332.9499 1336.8026 1340.9185 1345.9984 1356.5620 1358.4511 1367.2245 1369.3781 1372.3696 1435.5457 1439.0964 1452.7800 1459.4516 1461.7392 1467.0561 1471.7684 1474.4927 1486.0993 1495.7723 1503.0189 1622.9015 2948.5383 2952.4696 2967.0675 2968.3470 2979.4951 2985.7848 2990.0495 2990.7738 2998.6178 3008.4562 3011.3801 3019.3590 3026.9660 3033.2184 3047.3648 3049.1861 3050.3527 3063.1173 3152.5600 3540.5517 3550.0161
redmass: 5.4054 4.8926 3.9842 6.2729 4.9630 3.2583 3.8997 3.0098 2.2648 3.8723 2.8677 2.3817 2.5882 2.3043 1.6668 1.6905 2.4336 2.7133 1.9499 2.5187 1.6388 2.7110 1.4396 2.4362 3.8088 2.9591 2.6138 7.2903 1.6234 1.8345 2.5856 1.9300 1.8345 1.8228 2.0480 2.0219 2.1871 2.0234 2.4286 1.9900 2.0328 1.9866 2.3432 2.0548 1.6180 2.4023 1.7255 1.6450 1.7087 1.8197 1.3106 1.2809 1.4537 1.2641 1.3874 1.2303 1.1732 1.1823 1.1611 1.3193 1.3499 1.3571 1.4143 1.4320 1.3128 1.3837 1.3443 1.3544 1.4034 1.1712 1.1051 1.4331 1.0810 1.0906 1.0778 1.0886 1.1357 1.0917 1.0855 2.1888 5.1605 1.0618 1.0603 1.0653 1.0613 1.0648 1.0687 1.0691 1.0595 1.0889 1.0901 1.0898 1.0980 1.0999 1.0995 1.0978 1.0965 1.0985 1.0625 1.1118 1.0770 1.0767
irintensity: 0.6859 0.3649 0.2092 14.4655 4.6399 5.7244 7.7139 0.3089 0.2803 5.4091 1.6032 0.5949 0.1692 20.1326 2.3811 8.8455 12.1554 6.7041 2.4826 3.2724 0.8965 21.7452 165.0094 17.4311 41.8552 3.9514 6.8722 16.5948 4.6025 7.5522 4.1024 19.6324 0.3356 2.6678 5.3932 11.0466 5.8320 3.2053 3.9457 3.5336 3.8616 4.5575 12.6370 3.7121 1.1202 15.5548 1.2436 2.9657 3.6638 7.7782 12.2348 17.6094 63.4638 12.8853 121.1359 6.6288 0.8100 7.8125 20.9219 83.5746 1.5983 5.8206 0.7395 3.6634 0.7341 2.4850 1.7379 1.8357 2.9655 38.9568 16.9819 64.2804 0.4524 12.6855 7.1050 4.8943 18.8094 45.0268 24.4657 643.2334 169.1714 43.1920 27.2448 34.5534 17.7675 36.6291 17.0986 26.7646 63.6940 15.4678 48.1646 25.5279 19.5570 105.5232 116.7584 25.8256 6.8413 63.3372 24.2129 17.3262 18.0992 17.4188
temp: 298.150 k
press: 1.00000 atm
elementType: 17 8 7 7 6 6 6 6 6 6 6 6 6 6 6 1 1 1 1 1 1 1 1 1 1 1 1 1 1 1 1 1 1 1 1 1
symmnumber: 1
zpe: 824550.7 jmol-1
zpe.correction: 0.314055 hartree
zpe.thermalcorrener: 0.330517 hartree
zpe.thermalcorrenthalpy: 0.331461 hartree
zpe.thermalcorrgfe: 0.267945 hartree
zpe.sumelectzpe: -1075.359559 hartree
zpe.sumelectthermal: -1075.343097 hartree
zpe.sumelectthermalent: -1075.342153 hartree
zpe.sumelectthermalfe: -1075.405669 hartree
dipole: -1.5763 1.6701 -0.9031
dipole: 2.4677
quadrupole: -97.7888 -105.0384 -99.0699
quadrupole: -7.3302 -1.0697 1.2182
quadrupole: 2.8436 -4.4060 1.5625 -7.3302 -1.0697 1.2182
hfenergy: -1075.6736138 hartree
pointgroup: C01 [X(C11H21Cl1N2O1)]
dipole: -0.6273209 -0.6621597 0.3325887 debye
polarizability: 178.1284265|-1.6831235|142.3870714|3.5701551|-4.3660355|109.380804 unknown
InChI: InChI=1S/C11H21ClN2O/c12-8-9-13-11(15)14-10-6-4-2-1-3-5-7-10/h10,13-14H,1-9H2
charge 0 multiplicity 1
36 atoms
Cl 5.560628 -1.427726 0.253983
O  1.616433 1.874617 -0.485634
N  0.498134 -0.13157 -0.033125
N  2.747214 0.137633 0.608548
C  -0.786471 0.319564 -0.613787
C  -1.620471 1.104931 0.442752
C  -1.50199 -0.86586 -1.305737
C  -3.063759 1.48112 0.001512
C  -1.960586 -2.062104 -0.43502
C  -4.196839 0.586515 0.573377
C  -3.069055 -1.792633 0.62289
C  -4.253556 -0.904122 0.140377
C  1.613371 0.69641 -0.000369
C  3.999955 0.885076 0.67854
C  5.083279 0.345659 -0.256704
H  -0.512862 1.043866 -1.405243
H  -1.043009 2.022275 0.663484
H  -1.657182 0.53079 1.388073
H  -0.816549 -1.25075 -2.087411
H  -2.379946 -0.463551 -1.844077
H  -3.127473 1.506958 -1.10589
H  -3.274043 2.517548 0.331709
H  -1.088618 -2.531373 0.070703
H  -2.337233 -2.835614 -1.135178
H  -5.166863 1.054412 0.305469
H  -4.135778 0.620402 1.681871
H  -2.630583 -1.341659 1.533434
H  -3.461049 -2.779407 0.940436
H  -5.19555 -1.32103 0.549387
H  -4.351986 -0.971651 -0.962391
H  0.510026 -1.029691 0.45278
H  2.770829 -0.848677 0.873007
H  3.76015 1.921397 0.370568
H  4.383217 0.910642 1.716305
H  6.018923 0.920921 -0.188985
H  4.736792 0.261181 -1.29655
