program: Gaussian 09
title: 000260478
version: EM64L-G09RevD.01
frameworkgroup: C1[X(C14H18N2O5)]
method: RPBEPBE
basis: SDD
operation: Freq
keyword: #p
keyword: freq=noraman
keyword: PBEPBE/SDD
title: #p freq=noraman PBEPBE/SDD
converged: YES YES NO NO
title: Mulliken charges:
elementType: O O O O O N N C C C C C C C C C C C C C C H H H H H H H H H H H H H H H H H H
charge: -0.257912 -0.458936 -0.449041 -0.269470 -0.288116 -0.191457 -0.062913 -0.118055 -0.507417 -0.093340 -0.015891 -0.435277 0.351046 -0.274576 -0.025545 -0.458171 -0.456897 0.230680 0.220687 -0.535170 -0.522596 0.240584 0.269856 0.249780 0.239789 0.233341 0.230740 0.229947 0.317214 0.351613 0.251902 0.273621 0.352113 0.223993 0.245344 0.220153 0.209345 0.250406 0.228628
chargesum: 0.00000
title: Mulliken charges with hydrogens summed into heavy atoms:
elementType: O O O O O N N C C C C C C C C C C C C C C
charge: -0.257912 -0.107323 -0.096928 -0.269470 -0.288116 -0.191457 -0.062913 0.122529 0.012219 0.146449 0.217450 0.025410 0.351046 0.042638 -0.025545 -0.206269 -0.183276 0.230680 0.220687 0.154320 0.165782
polarizability: 2.55849636e+02 1.49870973e+01 1.76641957e+02 1.35640173e+01 -1.08625449e+01 1.25766706e+02
1716.lowfreq: -6.1458 -3.9646 -0.0006 0.0003 0.0007 6.9170 23.8250 32.1908 53.8248
frequency: 23.6462 32.1870 53.8069 63.7494 79.3215 92.6656 101.0095 109.0484 125.7435 158.7416 171.6295 189.4141 207.5491 245.5936 251.5333 257.1494 272.3712 301.0303 314.5830 337.9516 369.2206 378.7694 394.0009 401.8351 445.8842 455.6936 469.6989 483.9550 510.4530 523.0137 599.8123 617.5963 623.1483 655.1343 707.3625 720.6970 751.2744 762.4336 773.9574 817.8204 818.2190 834.6895 848.5662 869.6173 892.7835 903.5543 933.1682 947.2038 964.9967 975.0646 981.4084 1004.5633 1038.8154 1042.4260 1059.0766 1109.7590 1110.9117 1111.6570 1125.1508 1138.1469 1151.6373 1154.5228 1165.4276 1172.5746 1188.0042 1215.6746 1222.9744 1237.7474 1257.8308 1275.8456 1291.3365 1293.3640 1301.8295 1316.1906 1337.7314 1343.8984 1370.4091 1372.6386 1379.4935 1382.8229 1416.6187 1431.8624 1447.7103 1456.1417 1461.7883 1466.2254 1466.4107 1471.1184 1474.7748 1480.5706 1482.3966 1580.0478 1636.8955 2957.4001 2958.4692 2967.5683 2999.4614 3009.2925 3044.7174 3050.2585 3072.5080 3074.5111 3094.7755 3116.7189 3119.6278 3124.0578 3162.5861 3182.0932 3212.4552 3548.4532 3576.8999
redmass: 5.7658 4.7127 4.3656 5.2252 3.0665 3.2976 4.6240 4.5235 3.8298 2.1394 1.8852 3.1212 3.7392 1.3937 2.1120 1.2881 4.3800 3.7105 3.8971 4.1362 3.5093 5.1266 4.1030 5.0072 3.7317 1.3321 3.2786 4.0143 5.3168 4.7510 4.6157 4.7030 4.8205 4.9163 6.4249 5.7345 2.5037 5.0950 6.7350 2.6341 1.9415 3.7416 1.3547 4.0116 1.5614 2.4698 6.2432 5.3405 3.1216 4.7470 4.7549 3.0911 2.3209 1.9404 3.3169 1.4158 2.1452 1.2702 1.6550 1.8903 1.6121 1.4514 2.0429 2.2981 2.1066 1.2243 1.4668 1.6209 1.4310 1.2085 2.7848 1.3970 1.3217 1.2940 4.9875 1.2947 1.4595 1.4262 2.9796 1.6577 1.5994 1.3458 2.9097 1.1566 1.8000 1.1898 1.0831 1.5924 1.0817 1.3225 1.3056 9.8951 7.9816 1.0334 1.0833 1.0343 1.0862 1.0621 1.1038 1.0636 1.0983 1.0873 1.1042 1.1038 1.1034 1.0993 1.0912 1.0929 1.1004 1.0658 1.0668
irintensity: 0.0387 1.5776 3.6151 2.1460 5.7805 3.6818 9.0362 7.0159 2.3309 1.4458 4.8525 0.5233 3.5178 9.7281 27.6456 148.8114 8.0382 5.1807 3.4993 1.3863 15.1862 2.0841 1.9641 13.7685 3.6756 114.7905 79.3182 9.8821 7.2534 4.5932 13.2852 9.5792 5.9157 23.7678 5.0806 6.7352 0.0705 37.5936 8.6089 26.2470 31.2497 15.9025 10.5084 103.8450 29.9356 45.2703 25.6651 47.4307 24.5784 176.7930 29.4928 17.6093 33.1314 23.8850 30.0625 1.8544 58.2152 3.4429 11.3093 6.5416 18.7816 5.3615 5.5311 104.5846 39.9599 119.5678 134.5876 123.2103 4.9298 0.2128 61.0513 6.6003 9.4850 7.0947 21.0925 16.6903 68.8326 3.8877 47.0445 9.6941 8.0263 9.7839 86.5006 20.9551 17.0094 38.7285 10.7122 111.3128 7.2291 41.4875 1.7752 25.2811 17.7876 52.5153 29.3993 92.0633 47.8642 35.6311 45.9408 11.5250 37.6933 22.5123 23.4901 11.1259 24.9355 24.1791 6.9345 1.8985 18.5149 14.4701 12.9541
temp: 298.150 k
press: 1.00000 atm
elementType: 8 8 8 8 8 7 7 6 6 6 6 6 6 6 6 6 6 6 6 6 6 1 1 1 1 1 1 1 1 1 1 1 1 1 1 1 1 1 1
symmnumber: 1
zpe: 810689.1 jmol-1
zpe.correction: 0.308775 hartree
zpe.thermalcorrener: 0.329178 hartree
zpe.thermalcorrenthalpy: 0.330123 hartree
zpe.thermalcorrgfe: 0.258793 hartree
zpe.sumelectzpe: -1028.262827 hartree
zpe.sumelectthermal: -1028.242424 hartree
zpe.sumelectthermalent: -1028.241479 hartree
zpe.sumelectthermalfe: -1028.312809 hartree
dipole: -2.7964 5.7101 0.9178
dipole: 6.4240
quadrupole: -122.5237 -127.7497 -111.6934
quadrupole: 10.5774 1.6590 -6.9818
quadrupole: -1.8681 -7.0941 8.9622 10.5774 1.6590 -6.9818
hfenergy: -1028.571602 hartree
pointgroup: C01 [X(C14H18N2O5)]
dipole: 1.2409153 -2.1340187 0.5420307 debye
polarizability: 252.0023165|17.2410356|179.9288631|-23.2547453|2.9736655|126.3271204 unknown
InChI: InChI=1S/C14H18N2O5/c1-19-11-3-8-9(4-12(11)20-2)16(7-15-8)14-5-10(18)13(6-17)21-14/h3-4,7,10,13-14,17-18H,5-6H2,1-2H3
charge 0 multiplicity 1
39 atoms
O  2.23364 -1.352475 0.015392
O  4.286397 1.457093 -0.9352
O  5.450984 -0.309433 1.619525
O  -3.710715 -1.906341 0.072434
O  -4.687655 0.66556 0.546022
N  0.700892 0.332744 -0.87633
N  -0.138508 2.417705 -0.396906
C  1.645334 -0.733454 -1.203368
C  2.875698 -0.249723 -2.008448
C  3.977003 0.023356 -0.950445
C  3.352913 -0.461159 0.394782
C  4.332262 -1.221361 1.288357
C  -0.647804 0.13891 -0.510089
C  0.943576 1.724187 -0.770209
C  -1.156775 1.444829 -0.230646
C  -1.439699 -1.023173 -0.408309
C  -2.506431 1.602341 0.156332
C  -2.791094 -0.847744 -0.035854
C  -3.323193 0.463346 0.252316
C  -3.24577 -3.244313 -0.294431
C  -5.20748 0.011419 1.764137
H  1.08818 -1.548098 -1.692258
H  2.678031 0.652403 -2.607656
H  3.186229 -1.054934 -2.692261
H  4.895076 -0.555162 -1.172727
H  2.953562 0.427338 0.931275
H  4.786716 -2.065499 0.744534
H  3.834077 -1.606767 2.198203
H  1.925589 2.151414 -0.970307
H  5.021787 1.596705 -0.284265
H  -1.027803 -2.018258 -0.595139
H  -2.930781 2.586052 0.371587
H  5.205169 0.232537 2.410466
H  -2.893024 -3.270584 -1.343945
H  -4.125378 -3.895192 -0.182499
H  -2.437156 -3.591206 0.378796
H  -4.649279 0.356627 2.65678
H  -5.146901 -1.086781 1.679563
H  -6.25807 0.332886 1.834486
