program: Gaussian 09
title: 000260482
version: EM64L-G09RevD.01
frameworkgroup: C1[X(C19H21N5)]
method: RPBEPBE
basis: SDD
operation: Freq
keyword: #pfreq=noraman
keyword: PBEPBE/SDD
title: #p freq=noraman PBEPBE/SDD
converged: YES YES NO NO
title: Mulliken charges:
elementType: N N N N N C C C C C C C C C C C C C C C C C C C H H H H H H H H H H H H H H H H H H H H H
charge: -0.414984 -0.112825 -0.114413 -0.642734 -0.595868 -0.587357 -0.400932 0.246490 -0.440488 -0.003381 0.102273 0.316799 0.474884 -0.074851 -0.386512 -0.373934 -0.372094 -0.425186 -0.237499 -0.240646 -0.256788 -0.222757 -0.207340 -0.277373 0.194508 0.264270 0.204095 0.240577 0.228058 0.208760 0.289208 0.250479 0.260540 0.320866 0.325440 0.232352 0.216527 0.248955 0.223517 0.226823 0.218365 0.221567 0.225636 0.321635 0.325337
chargesum: 0.00000
title: Mulliken charges with hydrogens summed into heavy atoms:
elementType: N N N N N C C C C C C C C C C C C C C C C C C C
charge: -0.125776 -0.112825 -0.114413 0.003572 0.051105 -0.128579 0.043740 0.246490 -0.003669 -0.003381 0.102273 0.316799 0.474884 -0.074851 -0.136033 -0.113394 -0.139742 -0.208659 0.011456 -0.017130 -0.029965 -0.004392 0.014226 -0.051736
polarizability: 2.96974421e+02 -3.96133168e+01 2.65918948e+02 1.41433268e-01 -1.48664318e+00 1.67270793e+02
1716.lowfreq: -8.2069 -0.0007 -0.0005 0.0006 3.6490 9.7327 14.5715 28.5808 39.6117
frequency: 13.2331 28.5420 39.5863 49.3337 54.2034 61.3905 88.2248 114.3285 132.6264 171.5118 186.2942 213.4712 230.0906 247.9536 269.7456 276.9485 311.5894 321.1073 338.2501 352.1356 382.3028 389.4189 405.9593 407.8363 409.8630 425.8650 462.6718 479.6738 511.2813 519.9638 528.3760 541.5853 563.9526 578.8952 591.7902 614.1829 615.4994 656.6182 660.3639 691.7611 700.8935 708.4951 737.2399 754.2817 762.6897 782.5566 784.9166 806.4281 815.9034 849.1991 856.3951 868.2640 871.2008 923.5278 925.2513 954.7222 963.8770 973.6735 976.7869 979.3611 989.6936 991.9051 998.4443 1022.4064 1028.3121 1056.0709 1058.4764 1081.3899 1085.9241 1115.8088 1123.5555 1139.1650 1169.0696 1172.1535 1189.2773 1190.1007 1200.2959 1212.8620 1241.5577 1276.7920 1290.1532 1293.4131 1308.0524 1315.8290 1330.3752 1340.2484 1359.3541 1370.8965 1383.6704 1385.1084 1420.6223 1431.6848 1436.6994 1465.0589 1470.6953 1471.4003 1483.0453 1485.1628 1492.0066 1509.5172 1527.9488 1545.8682 1585.3984 1588.5608 1599.3169 1610.6481 1617.8007 1623.9652 2928.9973 2969.3351 2986.3719 3025.6744 3041.7994 3056.0711 3107.5504 3123.1531 3123.9150 3135.4143 3137.4696 3151.1696 3151.4396 3163.8493 3166.5083 3171.5461 3558.2167 3565.0314 3576.8566 3717.3581 3725.7358
redmass: 4.9061 5.5812 4.3566 4.9769 3.9243 4.0696 4.8751 4.5456 5.2245 4.3605 3.2842 5.1993 4.4395 4.7386 4.3594 2.6894 3.3095 1.3678 3.3428 2.2151 1.1800 2.3712 3.6490 2.9381 2.9667 1.2083 3.2541 3.2635 2.7810 1.1912 1.3278 2.2613 3.6605 4.4466 4.5697 6.2577 6.2914 6.3271 6.0750 1.8635 1.9983 4.6727 1.9210 1.8113 3.0373 2.8043 2.2505 6.8473 1.2608 3.1149 1.3952 1.9733 1.7358 2.0041 1.6104 1.3587 2.9631 1.2930 5.2924 1.4067 4.5999 2.4380 1.3382 2.2440 2.0503 2.1902 2.3760 1.8624 1.7169 2.4965 2.0646 1.7968 1.0500 1.0553 1.1105 1.1110 1.7736 4.0495 1.2933 1.6290 1.7834 2.2168 1.3844 1.4768 1.4219 1.4152 1.2965 5.3564 5.5236 4.0441 3.4497 2.2256 2.7552 1.4445 1.1455 1.8860 1.7589 1.6142 1.6219 2.4605 4.5029 4.8716 5.6979 4.9650 1.4823 5.0973 1.5328 5.6623 1.0703 1.0607 1.0625 1.1009 1.0914 1.0970 1.0871 1.0852 1.0858 1.0929 1.0892 1.0936 1.0935 1.0948 1.1006 1.0986 1.0453 1.0439 1.0770 1.1033 1.1059
irintensity: 0.0771 0.2608 0.0933 1.1590 0.5572 0.6004 1.5493 0.3002 2.3120 2.4856 0.5996 11.2582 0.2718 0.4341 2.5676 2.3253 2.5888 127.3396 7.8736 19.2897 129.6400 46.2321 20.1018 3.3009 1.1953 281.7258 2.2092 3.9580 13.1514 29.6526 28.0772 40.8356 5.2222 2.6850 4.1632 0.2534 0.3573 4.7670 3.3839 48.2625 35.6313 6.8308 12.8049 91.7280 48.0467 16.6727 10.0481 6.5450 0.5914 6.8472 2.9158 11.8780 6.2309 6.2217 1.6305 0.0296 4.4903 0.8880 3.3208 1.1452 0.7719 1.6848 0.9162 6.4899 9.6537 5.9434 0.6843 16.7956 1.6964 28.9876 5.5014 1.2107 1.3239 0.1991 2.0728 13.9944 12.0523 0.9480 22.1721 10.1873 2.4718 53.7309 8.1582 2.9471 30.2976 15.3087 18.9983 0.9823 1.9585 27.6654 116.3219 7.7560 43.3404 29.2352 13.4602 50.2320 10.4665 41.5573 2.0846 170.2050 324.7378 272.7051 1.1507 7.5621 557.0352 25.6288 353.2760 113.8191 44.0328 46.1518 44.1406 17.0469 25.1405 43.4341 14.1124 2.8596 3.2960 28.3664 7.3592 2.5438 63.3878 21.9578 13.6726 6.5748 68.6979 110.4899 23.1129 33.7864 40.8121
temp: 298.150 k
press: 1.00000 atm
elementType: 7 7 7 7 7 6 6 6 6 6 6 6 6 6 6 6 6 6 6 6 6 6 6 6 1 1 1 1 1 1 1 1 1 1 1 1 1 1 1 1 1 1 1 1 1
symmnumber: 1
zpe: 966602.5 jmol-1
zpe.correction: 0.368159 hartree
zpe.thermalcorrener: 0.389834 hartree
zpe.thermalcorrenthalpy: 0.390778 hartree
zpe.thermalcorrgfe: 0.315954 hartree
zpe.sumelectzpe: -1008.696781 hartree
zpe.sumelectthermal: -1008.675106 hartree
zpe.sumelectthermalent: -1008.674162 hartree
zpe.sumelectthermalfe: -1008.748986 hartree
dipole: 0.6151 -2.7922 -1.8228
dipole: 3.3907
quadrupole: -136.8399 -124.2922 -137.1147
quadrupole: -6.5581 4.2009 1.7069
quadrupole: -4.0909 8.4567 -4.3658 -6.5581 4.2009 1.7069
hfenergy: -1009.0649403 hartree
pointgroup: C01 [X(C19H21N5)]
dipole: -0.3384646 1.20573 -0.4595973 debye
polarizability: 305.4607119|-35.2575188|252.2068603|-3.2129777|20.6476344|172.4965894 unknown
InChI: InChI=1S/C19H21N5/c20-18-16(12-7-13-22-15-10-5-2-6-11-15)17(23-19(21)24-18)14-8-3-1-4-9-14/h1-6,8-11,22H,7,12-13,20-21H2
charge 0 multiplicity 1
45 atoms
N  2.247252 2.176163 -0.617348
N  -3.229635 -1.379493 0.069281
N  -4.39765 0.732851 0.433673
N  -3.37181 2.777162 0.067864
N  -5.470202 -1.324775 0.740161
C  -0.830081 1.557038 -0.716482
C  -0.061042 2.262566 0.437469
C  -2.029287 0.733381 -0.274912
C  1.192488 3.030002 -0.06444
C  -2.080496 -0.690672 -0.254044
C  -3.25751 1.397714 0.081105
C  -0.928133 -1.57811 -0.615245
C  3.157237 1.433849 0.143949
C  -4.325393 -0.633735 0.402583
C  0.404903 -1.32991 -0.192775
C  -1.189587 -2.749286 -1.37772
C  3.16436 1.465579 1.571005
C  4.126591 0.620456 -0.519801
C  1.452116 -2.211183 -0.544227
C  -0.144636 -3.625661 -1.736892
C  1.18317 -3.358075 -1.325022
C  4.115503 0.713855 2.29464
C  5.066176 -0.125493 0.216551
C  5.072828 -0.088433 1.633013
H  -1.158338 2.329789 -1.447638
H  -0.120036 0.91078 -1.260657
H  -0.721392 2.973932 0.97377
H  0.242864 1.510352 1.188687
H  1.6098 3.63814 0.762763
H  0.888264 3.743582 -0.855321
H  2.289678 2.063746 -1.628965
H  0.633166 -0.470956 0.44461
H  -2.223456 -2.958731 -1.668825
H  -2.595295 3.384572 -0.168823
H  -4.279807 3.173545 0.300483
H  2.434541 2.07163 2.117028
H  4.135648 0.581472 -1.617059
H  2.469954 -1.99828 -0.199139
H  -0.364864 -4.51935 -2.332106
H  1.995172 -4.041255 -1.59938
H  4.101641 0.754309 3.390306
H  5.800805 -0.738291 -0.319149
H  5.804399 -0.669922 2.203168
H  -6.304835 -0.808726 1.001752
H  -5.443071 -2.340126 0.751305
