program: Gaussian 09
title: 000260504
version: EM64L-G09RevD.01
frameworkgroup: C1[X(C19H20O6)]
method: RPBEPBE
basis: SDD
operation: Freq
keyword: #pfreq=noraman
keyword: PBEPBE/SDD
title: #p freq=noraman PBEPBE/SDD
converged: YES YES NO NO
title: Mulliken charges:
elementType: O O O O O O C C C C C C C C C C C C C C C C C C C H H H H H H H H H H H H H H H H H H H H
charge: -0.306411 -0.265931 -0.429190 -0.288854 -0.272073 -0.379747 0.200332 0.088971 0.551763 0.068718 0.223753 -0.357742 0.192239 -0.395653 -0.504867 0.208364 -0.294300 -0.437447 0.219522 -0.315212 -0.350312 -0.524589 -0.494959 -0.520554 -0.535002 0.223012 0.254797 0.253329 0.278344 0.239714 0.217821 0.243069 0.386705 0.225655 0.201524 0.286030 0.225912 0.217748 0.255405 0.213537 0.256889 0.233360 0.225935 0.232179 0.248219
chargesum: 0.00000
title: Mulliken charges with hydrogens summed into heavy atoms:
elementType: O O O O O O C C C C C C C C C C C C C C C C C C C
charge: -0.306411 -0.265931 -0.042485 -0.288854 -0.272073 -0.379747 0.200332 0.088971 0.551763 0.068718 0.223753 -0.134730 0.192239 -0.140856 -0.251538 0.208364 -0.015956 -0.197733 0.219522 -0.097391 -0.107243 0.188620 0.204106 0.183231 0.171330
polarizability: 5.92332039e+02 -2.63546530e+01 2.52830157e+02 -5.95718636e-01 3.80096735e+00 1.11243398e+02
1716.lowfreq: -2.3942 -0.0011 0.0005 0.0008 4.5216 5.6033 17.3225 22.2986 31.2695
frequency: 17.3078 22.2763 31.1886 35.4460 54.9807 72.9344 89.0067 103.6308 112.0915 122.0926 124.9456 135.5377 152.1858 158.8165 163.9977 180.7580 202.7361 208.0029 228.9507 234.0165 239.5445 255.4644 290.0857 293.9300 308.0361 324.2062 340.5685 374.0570 393.3045 398.4016 425.1625 450.6040 472.9092 481.2676 504.0818 517.5395 551.4127 570.4661 594.1354 606.1815 606.6503 630.4977 666.1467 690.4533 710.8198 727.2016 737.7744 763.4200 792.2212 795.5796 808.0899 871.7357 877.0280 895.4916 911.2956 919.9435 931.6498 936.2325 966.1979 979.7578 1000.6286 1006.4908 1037.2727 1055.5036 1108.0054 1108.5549 1110.4791 1111.2461 1111.5864 1118.6233 1145.6013 1153.9573 1156.6390 1158.5347 1177.8216 1179.7398 1208.7914 1213.1047 1240.2488 1254.5587 1264.7645 1276.9301 1297.8334 1318.9380 1357.6775 1380.7108 1398.1299 1415.1924 1415.7437 1423.3394 1433.5970 1438.3277 1443.7826 1451.9397 1453.0866 1458.4524 1464.7978 1467.5485 1470.6345 1472.0612 1480.8147 1487.9842 1495.6742 1539.8851 1563.4854 1576.2234 1608.7667 1627.2783 1630.6012 2285.0841 2966.7093 2969.6115 2977.1432 2993.8979 3062.6311 3082.9244 3086.2546 3101.9781 3104.3793 3128.5897 3130.0272 3130.8312 3133.3844 3136.3592 3151.8285 3160.5255 3163.9437 3165.7466 3181.1737
redmass: 4.5832 4.5077 3.2709 5.3812 4.6082 2.4450 1.9373 4.3289 4.0460 4.8807 5.1281 2.1139 2.1839 2.4155 2.1576 1.8542 2.6647 1.2808 2.7994 4.7888 2.2919 1.8371 4.3189 5.1805 5.6046 4.2791 4.6414 4.9276 6.2523 4.4228 5.4039 4.3476 3.7659 6.3137 5.8813 6.2303 4.7860 4.8678 4.9119 6.2968 5.2447 4.1084 6.2311 4.1739 5.7243 5.7629 3.2894 4.8153 5.9115 1.6574 1.5827 1.8578 6.3693 1.6749 5.2324 7.6439 1.3370 1.3557 6.6768 8.8309 3.1578 1.2369 3.8685 1.0670 1.4475 1.9421 1.2568 1.2378 1.3003 2.4489 1.4857 1.3358 1.4137 1.4191 1.7874 1.6859 3.1762 1.6153 2.0589 4.2931 1.8056 1.9114 3.1675 1.5456 3.5464 4.6320 3.7470 2.1465 1.9199 1.7824 1.2260 1.3967 1.6723 1.0885 1.0830 1.0773 1.0559 1.0536 2.4003 1.1021 1.0552 1.0549 2.6137 5.8994 6.8757 3.0651 6.0817 4.6737 3.6893 1.0825 1.0366 1.0323 1.0346 1.0313 1.1045 1.0945 1.0978 1.1009 1.0894 1.1054 1.1044 1.1000 1.1060 1.0892 1.0894 1.0902 1.0905 1.0925 1.0966
irintensity: 2.2494 1.3134 1.8233 0.6082 1.1404 5.6956 2.0278 10.4847 4.0637 4.8826 3.7080 1.7196 0.5908 0.8123 0.0764 3.1515 2.8176 0.6204 5.2592 5.7711 2.6943 0.6955 4.5372 2.2601 1.1108 9.5325 1.6539 2.6111 2.8737 1.5871 19.6504 14.5988 7.1727 0.2828 49.8729 48.9821 0.8370 9.7694 7.3078 8.6199 22.2145 11.9907 13.8707 0.9596 19.7029 5.1893 5.5602 4.7396 35.5886 64.9277 25.4313 16.2685 23.1711 9.3625 13.7071 19.8462 3.0642 0.5190 105.1436 81.8154 59.4583 40.7696 65.3181 130.5932 27.8683 142.1269 0.4619 15.5675 34.3229 51.5776 15.8663 75.7375 14.4849 13.6967 4.9733 16.2447 134.5229 28.0031 70.2254 1256.8499 101.3240 63.4623 186.4345 107.1557 51.9730 62.2170 290.3762 199.3938 2.1367 430.4194 3.4496 4.7997 70.9418 42.1450 20.6604 15.0744 20.1761 22.5733 28.8598 101.8057 26.0712 26.8659 282.4740 62.5555 12.5594 166.3329 256.3016 619.1129 170.4414 522.6318 109.0562 94.9610 91.7635 108.5365 38.8523 40.5786 40.0363 42.0317 0.4868 12.1206 13.6337 26.8325 19.6545 2.5624 0.6487 8.4382 11.2467 14.2737 8.9747
temp: 298.150 k
press: 1.00000 atm
elementType: 8 8 8 8 8 8 6 6 6 6 6 6 6 6 6 6 6 6 6 6 6 6 6 6 6 1 1 1 1 1 1 1 1 1 1 1 1 1 1 1 1 1 1 1 1
symmnumber: 1
zpe: 914814.6 jmol-1
zpe.correction: 0.348434 hartree
zpe.thermalcorrener: 0.373673 hartree
zpe.thermalcorrenthalpy: 0.374617 hartree
zpe.thermalcorrgfe: 0.291143 hartree
zpe.sumelectzpe: -1185.462333 hartree
zpe.sumelectthermal: -1185.437095 hartree
zpe.sumelectthermalent: -1185.436150 hartree
zpe.sumelectthermalfe: -1185.519625 hartree
dipole: 5.0736 0.4491 0.7263
dipole: 5.1450
quadrupole: -79.8273 -143.3957 -151.6436
quadrupole: -12.3889 -16.3436 -5.6917
quadrupole: 45.1283 -18.4402 -26.6880 -12.3889 -16.3436 -5.6917
hfenergy: -1185.8107678 hartree
pointgroup: C01 [X(C19H20O6)]
dipole: 1.9824123 0.0615952 -0.4044253 debye
polarizability: 591.3938997|33.6912906|207.3144602|-1.5791437|65.9716799|157.6972342 unknown
InChI: InChI=1S/C19H20O6/c1-22-15-9-6-12(11-17(15)24-3)5-8-14(20)13-7-10-16(23-2)19(25-4)18(13)21/h5-11,21H,1-4H3
charge 0 multiplicity 1
45 atoms
O  -6.032611 0.02088 0.89076
O  -5.745978 -2.220305 -1.010605
O  -3.668282 1.345283 1.664886
O  4.828272 -1.738359 -1.573688
O  6.860522 -0.06952 -0.498647
O  -1.227407 1.553415 1.634223
C  -2.281656 -0.160664 0.325086
C  -3.574716 0.293189 0.78907
C  2.768769 0.572363 0.49032
C  -4.779681 -0.347857 0.365255
C  -4.692129 -1.462078 -0.513762
C  -2.244084 -1.29047 -0.549373
C  -1.085827 0.543562 0.802071
C  -3.413483 -1.927427 -0.954113
C  3.189205 -0.494316 -0.357861
C  4.542228 -0.71239 -0.659636
C  1.369086 0.832829 0.820082
C  3.772672 1.414725 1.043594
C  5.536849 0.167388 -0.112021
C  0.262474 0.152774 0.372379
C  5.135007 1.217337 0.748796
C  -6.432182 1.44031 0.751284
C  -7.1567 -1.805238 -0.882772
C  5.860749 -2.731836 -1.207186
C  7.890953 0.861077 -0.021382
H  -1.287284 -1.671205 -0.916162
H  -3.396856 -2.789594 -1.625933
H  2.467264 -1.18255 -0.807683
H  1.171496 1.669759 1.505558
H  3.477234 2.23576 1.70668
H  0.363648 -0.690368 -0.3165
H  5.879849 1.892214 1.180071
H  -2.655342 1.651986 1.843615
H  -7.438519 1.495575 1.19429
H  -6.471666 1.726861 -0.318683
H  -5.728385 2.090037 1.294156
H  -7.70881 -2.571498 -1.449064
H  -7.317249 -0.809826 -1.333972
H  -7.4714 -1.78466 0.171154
H  5.585973 -3.241075 -0.263233
H  6.850252 -2.257747 -1.108188
H  5.857887 -3.455766 -2.035904
H  7.974769 0.835658 1.081781
H  7.679618 1.892995 -0.359408
H  8.827072 0.504373 -0.474542
