program: Gaussian 09
title: 000260429
version: EM64L-G09RevD.01
frameworkgroup: C1[X(C10H11NO3)]
method: RPBEPBE
basis: SDD
operation: Freq
keyword: #p
keyword: freq=noraman
keyword: PBEPBE/SDD
title: #p freq=noraman PBEPBE/SDD
converged: YES YES NO NO
title: Mulliken charges:
elementType: O O O N C C C C C C C C C C H H H H H H H H H H H
charge: -0.210002 -0.205571 -0.207289 0.018352 -0.554451 0.536389 -0.495983 -0.526314 -0.420447 0.238915 0.377665 -0.188042 -0.376388 -0.765334 0.242512 0.235261 0.249633 0.246544 0.291814 0.247533 0.238990 0.288656 0.259753 0.244480 0.233325
chargesum: 0.00000
title: Mulliken charges with hydrogens summed into heavy atoms:
elementType: O O O N C C C C C C C C C C
charge: -0.210002 -0.205571 -0.207289 0.018352 -0.076678 0.536389 0.000194 -0.234500 -0.172915 0.238915 0.377665 0.050948 -0.087733 -0.027777
polarizability: 1.70245502e+02 -3.54023952e+00 1.30504609e+02 1.30787419e+01 6.24723256e+00 7.97939081e+01
1716.lowfreq: -8.7893 -4.4608 -0.0007 -0.0005 -0.0003 4.5672 18.1891 27.9064 49.9422
frequency: 15.1607 27.8734 49.9269 79.0011 83.5029 107.6835 164.3639 176.8720 203.9050 248.4908 336.1901 376.3497 386.4590 427.3768 463.6800 495.2991 524.4623 549.5463 599.6867 658.6161 690.8529 704.1859 742.3061 754.7322 811.1423 836.7498 886.5750 913.2666 937.3147 954.5302 955.8820 989.4484 1000.2704 1034.3553 1053.2605 1087.1267 1090.7833 1150.2397 1170.2626 1175.9827 1209.0486 1228.8146 1263.4105 1282.5039 1298.7359 1346.0954 1370.6333 1371.7641 1396.3212 1430.4598 1435.9751 1443.7312 1456.7455 1472.1163 1479.3706 1587.7667 1616.9317 1635.5640 2967.2801 2982.0251 3012.8023 3016.6424 3068.3362 3074.4243 3121.7360 3131.0178 3158.0850 3164.0804 3187.7904
redmass: 3.9211 7.1691 10.1479 4.0999 2.1717 1.0526 5.3767 5.7624 4.7248 4.3575 3.2521 3.4589 5.5920 3.3405 2.0891 5.2185 5.4048 5.1262 4.7223 7.6252 2.6268 4.4012 1.3268 6.8443 1.7749 2.5932 2.6464 1.5214 1.5810 1.5775 1.8112 6.2165 1.3536 1.7309 3.2272 1.9072 1.6333 1.3068 2.0693 1.1343 4.2415 3.3838 1.2440 1.5861 1.3046 1.6785 1.2568 9.6595 6.4787 1.0849 2.7788 1.0665 1.0579 1.1261 2.6713 6.5297 7.0815 7.7715 1.0609 1.0389 1.0633 1.0941 1.0949 1.1024 1.1006 1.0891 1.0933 1.0923 1.0962
irintensity: 3.2824 6.5389 0.5932 0.8075 0.6415 0.1913 1.3790 3.0745 5.7950 0.2732 0.6325 1.2379 1.2381 1.0100 0.9616 11.4239 7.4723 3.8267 1.2342 9.7898 16.6890 26.8544 1.4942 19.6800 30.6400 7.1064 3.1265 2.4924 5.8849 14.4888 3.0135 0.1210 0.9320 8.2793 7.4989 21.6801 11.7817 8.9824 54.5522 11.0905 130.2620 130.1010 18.4439 71.8361 5.1105 28.1459 73.2567 104.1866 1.5141 21.8241 11.8688 21.4703 18.6760 20.0542 40.3424 2.9737 16.4084 112.9530 11.2887 4.7821 13.0009 4.9740 10.9910 13.6125 13.6883 7.8435 11.8086 3.9297 4.1055
temp: 298.150 k
press: 1.00000 atm
elementType: 8 8 8 7 6 6 6 6 6 6 6 6 6 6 1 1 1 1 1 1 1 1 1 1 1
symmnumber: 1
zpe: 503172.8 jmol-1
zpe.correction: 0.191648 hartree
zpe.thermalcorrener: 0.205310 hartree
zpe.thermalcorrenthalpy: 0.206254 hartree
zpe.thermalcorrgfe: 0.148055 hartree
zpe.sumelectzpe: -666.977795 hartree
zpe.sumelectthermal: -666.964134 hartree
zpe.sumelectthermalent: -666.963190 hartree
zpe.sumelectthermalfe: -667.021389 hartree
dipole: -2.9733 2.6317 2.6352
dipole: 4.7656
quadrupole: -103.3479 -78.9577 -83.3218
quadrupole: 15.6493 -10.6234 0.8378
quadrupole: -14.8054 9.5847 5.2207 15.6493 -10.6234 0.8378
hfenergy: -667.1694438 hartree
pointgroup: C01 [X(C10H11N1O3)]
dipole: 1.1685027 1.1612121 -0.895309 debye
dipolederiv: -0.7339833 0.0472507 -0.1281172 0.0456073 -0.3433565 -0.1414941 -0.1588109 -0.1370625 -0.7705411 -0.8944829 -0.0217476 -0.1436765 -0.0748312 -0.4756727 0.0160398 -0.1594993 0.0198927 -0.265317 -0.500535 -0.0206446 -0.0577466 -0.0434145 -0.8513148 0.0707475 -0.0618791 0.0581045 -0.2467208 1.3842343 0.2977119 0.2388434 0.4049319 1.3648198 -0.0540016 0.2545929 -0.0467537 0.2492354 -0.0943562 0.0648897 0.0179987 0.0625733 0.0904521 -0.0226375 0.1329699 -0.0274174 0.0744691 0.5309939 -0.1626057 0.0621833 -0.1894854 -0.1996966 -0.0071945 0.0957329 -0.0191469 -0.0522943 -0.5408381 0.1484349 -0.0824586 0.1619228 0.1108873 -0.0201216 -0.3337596 0.0203969 -0.035978 -0.1169136 0.267119 0.007817 -0.0933756 0.0057701 -0.030851 0.0355414 0.0536051 -0.1067041 -0.0542257 0.0739465 0.0456449 0.1647021 0.0817678 0.000037 0.0169887 -0.0068773 -0.1120323 1.2175095 -0.2666703 0.0521142 -0.2697904 0.2684865 0.2973465 0.1669553 0.2700662 0.889428 -0.2152332 -0.3253013 -0.0327804 -0.361386 -0.2538565 -0.0449317 -0.0338231 -0.0480402 0.06641 -0.1791353 -0.0969766 -0.0015553 -0.110731 0.1550349 -0.0495661 -0.0019062 -0.0492357 -0.1219553 -0.0748316 -0.0377548 0.0368174 0.2441275 0.0165914 0.0329564 -0.0126768 -0.0224162 -0.1205072 -0.274721 0.1416953 0.1830753 0.1869185 -0.1250752 -0.2308452 0.179271 -0.1754152 -0.2352695 0.0554026 -0.0357179 -0.0398606 -0.0545324 -0.0379444 -0.0734612 -0.0087502 -0.0429115 0.0468613 0.0430003 -0.0142399 0.0043288 0.014267 -0.0220976 0.1053066 0.0031112 0.0631971 0.0018426 0.0800507 0.0049753 0.011037 -0.0068964 0.0032904 0.1084796 0.0323969 0.0604703 -0.011306 0.0568773 -0.0469459 -0.0316182 -0.0464282 -0.0335978 -0.0981833 0.0245116 -0.0707228 0.0364601 0.1346799 0.0283838 -0.0190117 0.0630322 0.0418979 0.0217185 -0.0222791 0.0184333 0.1456197 0.0070371 -0.1089032 -0.0306775 -0.0974513 0.0171885 -0.0043485 -0.0317806 -0.0124722 0.1332473 0.0654501 0.0431484 -0.0231466 0.0433188 -0.0837215 0.0309171 -0.0284218 0.0340713 0.14389 0.0447161 0.0332669 -0.036931 0.0020675 0.1294939 0.0051077 -0.0340999 0.0120993 0.1657906 -0.1191902 -0.0047937 0.006114 -0.0243447 0.1191392 -0.0058085 -0.025751 -0.0250913 0.0803681 0.0971093 -0.0665397 0.0242258 -0.038282 -0.0594112 -0.007954 0.0163229 0.0149727 0.1035043 0.0813849 0.0580189 -0.0626196 0.0174803 0.0809249 0.1027422 -0.044957 0.0582535 -0.0585006 unknown
polarizability: 170.0915902|2.090127|131.2821345|13.8627855|0.2310942|79.1702945 unknown
InChI: InChI=1S/C10H11NO3/c1-8(12)5-6-9-3-2-4-10(7-9)11(13)14/h2-4,7H,5-6H2,1H3
charge 0 multiplicity 1
25 atoms
O  4.43422 -0.060203 0.97464
O  -4.302528 -0.813917 -0.520759
O  -2.704509 -2.342513 0.032249
N  -3.09607 -1.131535 -0.1884
C  1.628071 0.322707 0.799573
C  0.188858 0.655719 0.443918
C  2.451824 -0.068417 -0.451991
C  -0.777389 -0.369952 0.313589
C  -0.214136 1.996652 0.202603
C  3.930377 -0.33482 -0.14647
C  -2.097541 -0.038552 -0.055214
C  -1.543294 2.310542 -0.164313
C  -2.506404 1.290149 -0.299712
C  4.753867 -0.957557 -1.267754
H  2.121351 1.180046 1.290567
H  1.668123 -0.512334 1.522598
H  2.406493 0.741432 -1.210863
H  2.020187 -0.95894 -0.95223
H  -0.525562 -1.418553 0.500018
H  0.521779 2.802235 0.312193
H  -1.82982 3.352497 -0.339872
H  -3.542466 1.496923 -0.579155
H  5.828691 -0.805641 -1.082741
H  4.558554 -2.047677 -1.300965
H  4.475624 -0.547896 -2.255308
