program: Gaussian 09
title: 000260449
version: EM64L-G09RevD.01
frameworkgroup: C1[X(C11H14ClN5O4)]
method: RPBEPBE
basis: SDD
operation: Freq
keyword: #p
keyword: freq=noraman
keyword: PBEPBE/SDD
title: #p freq=noraman PBEPBE/SDD
converged: YES YES NO NO
title: Mulliken charges:
elementType: Cl O O O O N N N N N C C C C C C C C C C C H H H H H H H H H H H H H H
charge: 0.005718 -0.296252 -0.428211 -0.445795 -0.430866 -0.209537 -0.080140 -0.046362 0.027958 -0.604355 -0.112616 -0.148826 -0.121110 -0.050435 -0.458387 0.205636 -0.317928 -0.211637 -0.110886 0.191583 -0.331609 0.276720 0.261461 0.235579 0.259527 0.253874 0.215437 0.239543 0.183663 0.337732 0.384300 0.295787 0.333485 0.353220 0.343732
chargesum: 0.00000
title: Mulliken charges with hydrogens summed into heavy atoms:
elementType: Cl O O O O N N N N N C C C C C C C C C C C
charge: 0.005718 -0.296252 -0.090479 -0.061495 -0.097382 -0.209537 -0.080140 -0.046362 0.027958 0.092597 0.148844 0.127895 0.114469 0.209092 0.010924 0.205636 0.105277 0.084149 -0.110886 0.191583 -0.331609
polarizability: 2.33399740e+02 -2.25890853e+00 1.87804971e+02 -5.57223736e+00 -1.47735556e+01 1.11327164e+02
1716.lowfreq: -5.1199 0.0007 0.0013 0.0016 4.4108 5.0908 13.6425 31.8879 46.0213
frequency: 12.4356 31.8353 45.9622 68.4280 71.9913 95.6809 113.5245 114.4243 148.8721 180.3245 203.0215 217.6017 240.3256 246.3142 270.9832 278.1136 319.9703 323.1384 329.8411 340.7893 357.6892 368.2020 378.8601 437.3145 471.9817 522.6213 549.2459 553.6608 562.1304 588.0109 606.3637 626.3103 642.2884 657.9512 660.6365 696.7800 705.9153 746.7875 782.4323 789.5288 830.6183 842.3428 861.1139 881.4305 908.3651 966.6470 972.3661 983.2182 997.2050 998.1279 1023.0176 1038.5881 1047.0328 1059.4471 1070.5710 1086.0073 1154.9181 1155.5574 1185.9943 1192.6402 1199.0125 1224.2131 1234.2051 1264.4328 1272.5301 1280.5459 1286.7744 1298.2223 1302.6910 1321.0089 1338.7669 1350.3738 1352.9930 1356.2197 1374.9011 1389.8638 1390.8330 1407.4495 1426.3144 1464.5578 1473.3618 1483.9204 1539.3267 1580.8007 1638.1089 2951.4735 2968.6185 2976.8103 2980.9845 3041.1114 3063.2909 3096.5180 3104.0079 3263.6941 3289.9681 3535.5712 3540.4351 3560.0761 3688.5730
redmass: 7.6583 6.7673 7.9545 6.0106 7.6486 1.9801 9.1180 5.1488 4.7312 6.7048 4.5082 6.1196 5.3698 4.1317 5.4379 4.4944 2.0606 1.7554 2.8108 1.7556 6.0306 11.8967 4.2519 4.6554 4.1638 8.8369 1.2702 1.0983 4.6947 3.4816 4.8405 4.3313 6.8347 6.7857 8.5316 2.8465 1.3353 8.8541 2.0410 7.4962 2.9336 1.5190 2.7218 5.8020 3.7229 4.0138 4.2630 5.3506 2.7839 2.6889 3.4672 4.5320 3.9079 4.0038 2.4829 2.1162 3.0358 1.6135 1.5974 1.2996 1.4989 2.2206 1.3330 1.2202 1.7774 1.8978 1.3412 2.4810 1.5550 1.8876 1.2516 5.2887 1.3449 1.3859 1.2408 1.4459 4.2707 1.5137 4.9462 1.1612 3.9141 1.0868 8.1925 1.9225 2.6357 1.0708 1.0835 1.0814 1.0678 1.0935 1.0898 1.0949 1.0876 1.0992 1.0661 1.0447 1.0661 1.0663 1.1057
irintensity: 0.2423 0.7603 1.3314 2.4372 4.5833 7.1358 0.9524 2.5945 2.1146 8.3650 3.0209 1.4919 5.9430 8.8468 17.1136 5.0202 5.3856 126.8316 72.5185 56.7335 33.3183 2.3673 11.1203 15.7210 4.2565 12.7896 222.4308 12.7417 24.1190 7.8526 7.8694 42.2846 34.5217 14.0369 6.2578 26.9864 99.1443 24.4336 5.4834 14.1004 11.1511 12.5999 41.9887 24.9527 79.4393 77.5180 70.5329 23.9802 34.4241 35.4331 122.0412 15.6981 34.9841 71.8857 4.7372 13.8662 68.5438 23.5472 34.4558 44.9514 32.3395 76.1807 17.1960 10.7567 119.2073 91.3666 8.1858 98.8871 12.5511 45.7605 22.9728 114.9921 5.6248 20.3990 6.5357 14.6535 66.9660 35.5644 65.2956 19.9104 45.5373 6.2065 116.9848 62.0963 669.3782 60.2952 2.4491 33.1690 27.5727 3.4279 37.5534 27.9315 7.5405 4.5381 335.5164 161.5423 8.1757 7.2142 57.8554
temp: 298.150 k
press: 1.00000 atm
elementType: 17 8 8 8 8 7 7 7 7 7 6 6 6 6 6 6 6 6 6 6 6 1 1 1 1 1 1 1 1 1 1 1 1 1 1
symmnumber: 1
zpe: 687410.5 jmol-1
zpe.correction: 0.261821 hartree
zpe.thermalcorrener: 0.281457 hartree
zpe.thermalcorrenthalpy: 0.282401 hartree
zpe.thermalcorrgfe: 0.211793 hartree
zpe.sumelectzpe: -1460.688901 hartree
zpe.sumelectthermal: -1460.669265 hartree
zpe.sumelectthermalent: -1460.668321 hartree
zpe.sumelectthermalfe: -1460.738929 hartree
dipole: -0.4677 -3.9316 1.5949
dipole: 4.2685
quadrupole: -107.9144 -138.2823 -139.7394
quadrupole: -16.6220 -1.9446 -7.1817
quadrupole: 20.7309 -9.6369 -11.0940 -16.6220 -1.9446 -7.1817
hfenergy: -1460.9507218 hartree
pointgroup: C01[X(C11H14Cl1N5O4)]
dipole: 0.0663332 -1.4510573 -0.8427443 debye
polarizability: 233.5586539|-1.2419281|181.8880171|-2.9588381|25.3601006|117.0852041 unknown
InChI: InChI=1S/C11H14ClN5O4/c12-11-15-8(13)5-9(16-11)17(3-14-5)10-7(20)6(19)4(21-10)1-2-18/h3-4,6-7,10,18-20H,1-2,13H2
charge 0 multiplicity 1
35 atoms
Cl -3.445105 2.921039 1.136286
O  2.160248 -0.962964 -0.645035
O  2.744007 1.520551 -2.647059
O  0.956386 2.302273 0.30997
O  5.294892 -1.189837 2.360689
N  -0.186537 -0.816735 -0.307261
N  -1.776696 -2.386781 -0.823295
N  -1.662873 1.05009 0.406029
N  -4.028617 0.443564 0.269126
N  -4.792223 -1.663571 -0.46507
C  3.323607 -0.010674 -0.751159
C  2.674134 1.330133 -1.195488
C  1.209595 1.265341 -0.666162
C  1.099832 -0.163477 -0.038058
C  4.097454 0.083137 0.577422
C  -1.418406 -0.218603 -0.054446
C  4.627528 -1.282057 1.054783
C  -0.457102 -2.120497 -0.7619
C  -2.389318 -1.202599 -0.375644
C  -3.753017 -0.823693 -0.195756
C  -2.996641 1.270099 0.530661
H  3.184598 2.20947 -0.776568
H  3.9615 -0.430436 -1.548208
H  0.516713 1.339562 -1.530874
H  1.239431 -0.081872 1.060434
H  3.470818 0.52928 1.372411
H  4.94755 0.779106 0.418613
H  3.793541 -1.982867 1.21715
H  5.304768 -1.720782 0.289274
H  2.303367 0.7534 -3.096296
H  -0.020068 2.232712 0.544436
H  0.343223 -2.802605 -1.032865
H  6.077454 -0.587285 2.284267
H  -4.606122 -2.604327 -0.807873
H  -5.746321 -1.339895 -0.316632
