program: Gaussian 09
title: 000260433
version: EM64L-G09RevD.01
frameworkgroup: C1[X(C11H14ClN3O)]
method: RPBEPBE
basis: SDD
operation: Freq
keyword: #p
keyword: freq=noraman
keyword: PBEPBE/SDD
title: #p freq=noraman PBEPBE/SDD
converged: YES YES NO NO
title: Mulliken charges:
elementType: Cl O N N N C C C C C C C C C C C H H H H H H H H H H H H H H
charge: -0.079594 -0.254524 0.028581 -0.415569 -0.650782 -0.503309 -0.542610 0.479287 0.195104 -0.365614 -0.410218 -0.815276 -0.092847 -0.235226 -0.242601 0.299211 0.208383 0.238765 0.250366 0.212212 0.254346 0.288160 0.250863 0.229654 0.246626 0.239391 0.255641 0.287598 0.344110 0.299873
chargesum: 0.00000
title: Mulliken charges with hydrogens summed into heavy atoms:
elementType: Cl O N N N C C C C C C C C C C C
charge: -0.079594 -0.254524 0.028581 -0.127971 -0.006799 -0.056161 -0.080032 0.479287 0.195104 -0.111268 -0.122058 -0.088133 -0.092847 0.004164 0.013040 0.299211
polarizability: 1.86507051e+02 -1.51917954e+01 1.63036502e+02 -1.23801047e+01 7.46882886e+00 1.12119909e+02
1716.lowfreq: -12.4964 -1.6958 0.0023 0.0027 0.0028 3.5184 14.0382 19.0525 40.0626
frequency: 10.4581 18.9605 40.0491 45.7257 107.6739 113.3530 130.7509 153.9845 174.1290 197.6902 227.2468 250.1127 276.4151 285.2338 334.3834 361.7651 385.7315 429.5491 437.3277 452.6734 491.4082 503.0302 516.5894 551.5058 561.3123 585.4403 625.2647 665.0076 687.1091 710.8680 769.3635 788.0331 798.0946 866.1030 906.0954 918.6003 931.8796 945.5729 980.9806 989.2264 1000.9519 1020.3966 1035.5427 1046.6436 1075.3695 1092.8160 1118.8388 1179.8841 1192.2465 1204.0481 1218.2826 1272.6412 1294.2205 1299.7848 1329.0791 1347.4590 1377.1539 1386.3208 1423.6088 1451.0317 1454.7669 1462.1238 1470.9335 1479.3044 1503.7775 1572.5882 1601.2770 1609.9461 1611.7128 1682.1474 2954.7753 2962.8293 2979.6142 3009.3116 3025.8578 3066.2116 3096.7262 3141.0458 3142.7793 3167.4181 3177.1569 3419.3096 3537.6632 3695.2983
redmass: 5.4268 8.6008 3.8770 3.8678 5.2608 5.6245 1.4717 2.9867 3.8457 3.4789 2.8011 2.0335 2.5436 2.1182 4.1465 2.5410 7.8162 2.8289 3.0463 1.9503 1.6653 1.5976 3.1837 2.9500 3.2436 2.5467 4.3683 6.3619 2.5965 8.4687 1.8699 2.4493 2.6840 1.4718 1.4728 1.6720 2.6737 1.8103 2.8067 1.8174 1.7916 1.6286 3.4934 2.3242 2.1444 1.6859 2.4633 1.3372 1.1800 1.9991 1.2233 2.5468 2.1344 1.5042 1.5430 1.7326 4.5482 1.2369 2.4082 1.2149 1.1406 1.1396 2.0329 1.0750 1.4760 6.1712 1.2797 6.6387 5.8970 5.4495 1.0399 1.0608 1.0656 1.0997 1.0975 1.0950 1.0951 1.0921 1.0878 1.0928 1.0987 1.0748 1.0459 1.1035
irintensity: 7.9477 7.8467 7.9595 0.7107 6.4588 3.8537 1.8693 0.7393 1.4522 0.2065 2.3582 0.9678 4.9058 10.5025 3.0535 5.6408 28.1725 5.0471 4.2868 173.9396 129.8698 14.1342 8.1268 35.3805 16.0640 27.7125 11.0438 10.6272 21.8106 22.7521 36.8747 35.2069 28.6770 3.2692 7.6666 5.2522 2.8039 13.1173 7.5460 1.3318 9.5399 6.3470 7.9110 32.9066 15.3760 17.7836 86.1273 36.2916 13.0231 23.0785 2.3586 38.7442 255.6074 66.3164 8.3474 2.9411 3.7404 29.3054 16.2592 145.3908 39.2011 41.3900 32.5157 23.3809 169.6421 40.0149 126.1253 22.9827 9.8252 291.5339 16.5893 15.1303 55.0237 21.6427 21.0527 16.6823 15.3882 5.3856 4.0816 0.7913 5.9851 12.9414 45.0815 40.9406
temp: 298.150 k
press: 1.00000 atm
elementType: 17 8 7 7 7 6 6 6 6 6 6 6 6 6 6 6 1 1 1 1 1 1 1 1 1 1 1 1 1 1
symmnumber: 1
zpe: 618562.6 jmol-1
zpe.correction: 0.235598 hartree
zpe.thermalcorrener: 0.252318 hartree
zpe.thermalcorrenthalpy: 0.253263 hartree
zpe.thermalcorrgfe: 0.187926 hartree
zpe.sumelectzpe: -1125.907804 hartree
zpe.sumelectthermal: -1125.891084 hartree
zpe.sumelectthermalent: -1125.890140 hartree
zpe.sumelectthermalfe: -1125.955476 hartree
dipole: 3.3088 3.1754 4.4756
dipole: 6.4080
quadrupole: -102.8681 -91.5736 -100.1150
quadrupole: 0.3498 23.3280 -2.7195
quadrupole: -4.6825 6.6120 -1.9294 0.3498 23.3280 -2.7195
hfenergy: -1126.1434023 hartree
pointgroup: C01 [X(C11H14Cl1N3O1)]
dipole: 1.8518677 -0.8389186 -1.4908762 debye
polarizability: 169.559979|2.9321974|154.6551846|34.8268313|20.1553699|137.4482989 unknown
InChI: InChI=1S/C11H14ClN3O/c1-8(14-15-11(13)16)5-6-9-3-2-4-10(12)7-9/h2-4,7,15H,5-6,13H2,1H3
charge 0 multiplicity 1
30 atoms
Cl -4.737623 1.130202 -2.462269
O  2.764058 1.187043 2.444785
N  1.726059 -0.862062 0.823101
N  2.809836 -0.083032 0.444729
N  4.44979 1.531283 0.868833
C  -1.261696 -2.301745 -0.367392
C  0.046665 -2.536966 0.43589
C  -1.853727 -0.892606 -0.316789
C  1.235432 -1.724527 -0.043388
C  -2.853173 -0.551373 -1.268353
C  -1.481571 0.07182 0.654702
C  1.769288 -1.939793 -1.451488
C  -3.452738 0.718205 -1.222861
C  -2.100874 1.34299 0.677681
C  -3.099488 1.684701 -0.262221
C  3.298309 0.896925 1.345495
H  -1.10293 -2.584429 -1.427679
H  -2.01873 -3.015257 0.018667
H  -0.111257 -2.31237 1.505142
H  0.291571 -3.616738 0.364834
H  -3.159097 -1.274448 -2.032663
H  -0.694053 -0.148448 1.380619
H  1.243953 -2.770305 -1.949164
H  2.850251 -2.189805 -1.447131
H  1.634646 -1.037913 -2.083158
H  -1.798628 2.078148 1.43113
H  -3.581746 2.666158 -0.250315
H  3.219258 -0.156414 -0.49542
H  4.832733 2.271108 1.451761
H  4.969182 1.23495 0.045019
