program: Gaussian 09
title: 000260472
version: EM64L-G09RevD.01
frameworkgroup: C1[X(C12H16N6O6)]
method: RPBEPBE
basis: SDD
operation: Freq
keyword: #p
keyword: freq=noraman
keyword: PBEPBE/SDD
title: #p freq=noraman PBEPBE/SDD
converged: YES YES NO NO
title: Mulliken charges:
elementType: O O O O O O N N N N N N C C C C C C C C C C C C H H H H H H H H H H H H H H H H
charge: -0.263097 -0.453560 -0.505564 -0.450038 -0.400751 -0.233738 -0.185753 -0.072834 -0.311533 -0.121548 -0.380137 -0.596430 -0.187932 -0.058603 -0.223048 -0.010733 -0.372989 0.314014 -0.216356 -0.179393 0.232713 0.072129 -0.407420 0.168844 0.263808 0.240563 0.263151 0.232988 0.206296 0.221388 0.349967 0.415875 0.274256 0.373473 0.373530 0.279088 0.278187 0.343203 0.335145 0.392838
chargesum: 0.00000
title: Mulliken charges with hydrogens summed into heavy atoms:
elementType: O O O O O O N N N N N N C C C C C C C C C C C C
charge: -0.263097 -0.103594 -0.089689 -0.076565 -0.007913 -0.233738 -0.185753 -0.072834 -0.311533 -0.121548 -0.006607 0.081917 0.075876 0.181960 0.040103 0.222255 0.054695 0.314014 0.057901 -0.179393 0.232713 0.072129 0.149855 0.168844
polarizability: 2.69460848e+02 4.51222736e+00 2.07176474e+02 4.22429700e+00 -1.39103667e+01 1.16026898e+02
1716.lowfreq: -6.8729 -4.2931 -0.0009 -0.0007 -0.0003 5.4362 20.1019 34.1814 46.8470
frequency: 19.9966 34.0632 46.8444 51.7341 57.0189 75.1046 95.2495 107.2294 126.6596 140.9999 151.6391 197.3538 202.1888 216.3552 224.2472 235.3556 272.9978 295.4051 312.1142 321.3091 327.2150 349.6819 368.1994 417.0681 442.8520 455.1144 462.3562 478.3387 496.1916 502.7709 505.6430 549.6409 568.4060 584.8326 629.4140 633.4062 639.3292 647.9697 672.7030 696.7662 710.5842 713.6535 725.2153 774.2539 777.9244 800.8612 803.9286 805.6717 844.9861 880.2340 897.9583 930.9362 946.3382 971.3081 989.3948 989.9182 995.8717 1011.3650 1027.1878 1030.6876 1036.6242 1046.2135 1059.0654 1082.2310 1112.6220 1139.8012 1162.0013 1169.5610 1192.1851 1197.3795 1199.7224 1212.0817 1232.3221 1251.5149 1263.2888 1273.7514 1280.1177 1296.1666 1304.3745 1327.5947 1339.1470 1348.1308 1350.2361 1359.6781 1387.6607 1398.7003 1409.8978 1435.5711 1446.2224 1465.8172 1470.4692 1479.6375 1515.2180 1575.8633 1604.6601 1624.4224 1633.0325 1669.8192 2369.1728 2978.5884 2991.8465 3001.6495 3015.8187 3026.2459 3030.6796 3051.8950 3091.2673 3235.8662 3342.6573 3509.3556 3523.7965 3555.6810 3576.3795 3711.6537
redmass: 7.3189 5.7047 5.7163 8.9450 7.4722 5.5171 2.9500 5.7711 6.4491 4.1634 5.0385 6.8799 6.2258 6.1785 5.2818 7.3438 5.7385 4.6325 5.3229 6.1953 1.3640 3.7443 5.5363 4.1512 5.6969 5.5119 5.2631 1.2665 1.7745 1.0896 6.3050 6.8644 5.4978 4.0249 1.3280 3.7460 5.4832 1.7204 2.7372 4.7000 3.6287 9.4095 5.2417 1.2142 3.3199 3.4751 3.6206 3.4189 8.4960 3.7913 4.5012 3.7790 2.3275 4.7367 4.4972 2.0531 4.9124 2.9379 3.1690 2.1420 1.5139 2.4842 2.2252 3.6648 2.6789 3.0917 1.3585 2.3540 1.3005 1.0854 1.4666 2.1869 2.4049 1.2364 1.5430 1.1550 1.3055 3.8833 1.2814 1.4948 1.6960 1.6309 1.5744 4.6012 2.2258 2.2250 1.2347 3.1412 1.8669 1.2307 1.0779 4.1050 4.2550 3.2008 2.8104 1.2129 3.0088 8.2530 1.0916 1.0675 1.0598 1.0844 1.0870 1.0853 1.0998 1.0878 1.0978 1.0987 1.0651 1.0779 1.0643 1.0452 1.0663 1.1056
irintensity: 0.1869 1.9526 1.1216 0.9576 0.3465 2.0890 8.7729 1.5928 1.2135 4.9294 9.0301 8.0659 1.5028 1.8081 0.6699 2.3432 4.0005 6.8352 1.3933 8.4709 151.6092 4.2387 2.8727 7.2765 27.1662 4.6522 4.2004 253.2078 40.2929 10.8002 42.4294 4.5663 42.1400 2.5959 42.2381 0.3406 10.1829 162.1391 48.7736 14.9800 41.9379 13.2948 5.6085 122.6994 25.7680 100.5438 35.0432 15.2172 6.2143 1.6882 25.4570 37.5306 29.8795 23.0566 90.6660 1.6164 77.7739 97.3936 56.7354 26.2130 110.1374 17.5024 317.3167 57.1825 2.6726 36.2809 15.7927 39.0176 44.8797 0.0399 16.2124 9.6085 29.4859 0.9314 8.9425 6.1772 9.2706 1.9876 0.3028 18.7682 53.8445 173.1832 40.9187 78.9727 46.8723 10.6624 100.4805 14.2832 23.0657 20.5755 4.9126 211.9882 8.4697 82.7014 888.1811 6.9279 736.5588 166.0587 2465.1311 40.8756 44.3027 38.2689 38.7700 17.5243 5.8379 30.3240 49.9242 0.5803 104.3334 175.6511 38.7800 118.5305 12.0310 58.3923
temp: 298.150 k
press: 1.00000 atm
elementType: 8 8 8 8 8 8 7 7 7 7 7 7 6 6 6 6 6 6 6 6 6 6 6 6 1 1 1 1 1 1 1 1 1 1 1 1 1 1 1 1
symmnumber: 1
zpe: 793156.4 jmol-1
zpe.correction: 0.302097 hartree
zpe.thermalcorrener: 0.323931 hartree
zpe.thermalcorrenthalpy: 0.324876 hartree
zpe.thermalcorrgfe: 0.249898 hartree
zpe.sumelectzpe: -1244.948547 hartree
zpe.sumelectthermal: -1244.926713 hartree
zpe.sumelectthermalent: -1244.925769 hartree
zpe.sumelectthermalfe: -1245.000746 hartree
dipole: 3.9131 0.8140 -3.1421
dipole: 5.0841
quadrupole: -126.1768 -142.4258 -138.4101
quadrupole: 24.1288 10.3912 -2.2850
quadrupole: 9.4941 -6.7549 -2.7392 24.1288 10.3912 -2.2850
hfenergy: -1245.2506446 hartree
pointgroup: C01 [X(C12H16N6O6)]
dipole: -1.5938065 0.151484 1.1990836 debye
polarizability: 269.3815692|-2.1643876|204.4185335|8.2935274|20.3458596|118.8641171 unknown
InChI: InChI=1S/C12H16N6O6/c13-12-16-9(14-1-5(20)21)6-10(17-12)18(3-15-6)11-8(23)7(22)4(2-19)24-11/h3-4,7-8,11,14,19-20,22-23H,1-2,13H2
charge 0 multiplicity 1
40 atoms
O  3.020529 -0.595264 -1.161292
O  4.188355 -1.867841 1.601883
O  2.877409 1.610287 1.110842
O  4.582162 2.7389 -0.685312
O  -7.008996 0.593758 -0.202484
O  -5.979565 -1.43573 -0.694433
N  1.063953 -1.451913 -0.093107
N  -1.048377 -2.258516 -0.514644
N  0.460975 0.885297 0.522831
N  -1.960139 1.286385 0.437103
N  -3.490714 -0.394155 -0.186792
N  -0.464745 2.969665 1.068251
C  3.160591 -0.875358 1.253631
C  2.529515 -1.432777 -0.058883
C  3.781762 0.497326 0.858836
C  4.106065 0.298046 -0.647354
C  4.077671 1.609041 -1.468135
C  0.184458 -0.390432 0.12905
C  0.259662 -2.547176 -0.491382
C  -1.108052 -0.905799 -0.12629
C  -2.20327 -0.00241 0.040341
C  -0.660516 1.671544 0.66299
C  -4.621655 0.50983 -0.02575
C  -5.902626 -0.237658 -0.34635
H  2.420997 -0.75746 2.068754
H  2.869762 -2.477252 -0.188572
H  4.699275 0.701957 1.436988
H  5.070469 -0.238155 -0.744111
H  3.033114 1.773549 -1.804081
H  4.729524 1.538633 -2.352874
H  4.669687 -1.569132 2.413874
H  1.888993 1.348092 0.831537
H  0.69783 -3.510071 -0.744638
H  3.964612 2.797643 0.103907
H  -3.677497 -1.357334 -0.485573
H  -4.537104 1.393303 -0.687985
H  -4.67942 0.913376 1.003685
H  0.473401 3.31334 1.260076
H  -1.274757 3.573458 1.174425
H  -7.841037 0.091507 -0.417464
