program: Gaussian 09
title: 000260428
version: EM64L-G09RevD.01
frameworkgroup: C1[X(C17H16N2O5)]
method: RPBEPBE
basis: SDD
operation: Freq
keyword: #p
keyword: freq=noraman
keyword: PBEPBE/SDD
title: #p freq=noraman PBEPBE/SDD
converged: YES YES NO NO
title: Mulliken charges:
elementType: O O O O O N N C C C C C C C C C C C C C C C C C H H H H H H H H H H H H H H H H
charge: -0.203226 -0.201299 -0.207869 -0.200275 -0.197537 0.019677 0.018033 -0.164645 -0.621962 -0.610928 0.554735 0.535914 0.221888 -0.539659 -0.532072 -0.394281 -0.414154 -0.784110 0.369151 0.371015 -0.197833 -0.193653 -0.375497 -0.376586 0.245374 0.230744 0.250817 0.234087 0.252996 0.299869 0.316225 0.242606 0.244469 0.251884 0.229789 0.264721 0.241398 0.238428 0.292014 0.289749
chargesum: 0.00000
title: Mulliken charges with hydrogens summed into heavy atoms:
elementType: O O O O O N N C C C C C C C C C C C C C C C C C
charge: -0.203226 -0.201299 -0.207869 -0.200275 -0.197537 0.019677 0.018033 0.080730 -0.140401 -0.123844 0.554735 0.535914 0.221888 -0.239790 -0.215848 -0.151675 -0.169685 -0.037715 0.369151 0.371015 0.043566 0.044775 -0.083482 -0.086838
polarizability: 2.78018823e+02 2.74365598e+01 1.74914489e+02 -1.60240067e+01 -9.03143644e+00 2.03408262e+02
1716.lowfreq: -10.0910 -5.7888 -0.0009 -0.0008 -0.0007 3.9035 12.0577 13.8764 22.2328
frequency: 11.5791 13.8392 22.2322 29.8355 39.4103 48.1655 52.3760 71.5666 86.4257 129.1456 139.7204 152.1647 166.5410 172.8761 197.8925 221.0216 239.2551 258.2157 324.3869 344.9810 360.9217 385.5543 386.7065 405.6647 425.6962 429.4053 482.4115 499.6793 520.4488 524.8792 551.1255 575.6407 602.0204 608.7312 657.4782 658.3862 685.2570 696.2190 702.1729 706.9945 747.6606 758.7360 778.0494 818.7244 821.0077 852.7517 879.8259 900.2297 930.7621 937.8453 944.1005 953.6577 960.4057 976.9096 988.9664 989.4036 991.4902 1000.0366 1000.2931 1027.0590 1064.5516 1082.3621 1088.0632 1089.6900 1092.6728 1156.6713 1166.2585 1175.2083 1176.9415 1204.1781 1208.7769 1210.7895 1226.6781 1229.1857 1268.2661 1293.9214 1301.2173 1305.7089 1316.4668 1341.4491 1368.9608 1372.6586 1373.7697 1397.0944 1397.5792 1435.0894 1436.6402 1440.3385 1451.8121 1468.3652 1473.4607 1478.2421 1479.1272 1588.1281 1588.4908 1615.8534 1616.1343 1633.3209 2976.4944 2988.9007 2992.0936 3003.6246 3056.0980 3058.6558 3066.5328 3123.1265 3125.8974 3126.0008 3156.6710 3158.0411 3166.6489 3171.6033 3187.4989 3187.6612
redmass: 6.9451 7.4172 5.9078 4.5918 5.2354 13.1134 10.7862 6.7461 4.9006 1.3041 2.7215 6.1947 5.4280 5.1791 5.1294 4.8672 4.1964 3.9578 4.7203 3.0250 2.5288 6.8269 6.1367 3.2118 3.3218 3.3831 4.5307 4.8335 5.9278 5.3892 4.3027 3.8477 4.1381 3.9192 7.5056 7.1537 3.4027 2.2258 3.1278 6.4434 6.1028 7.1680 2.9768 1.6065 1.5505 2.0696 3.8059 3.3915 1.5086 1.5427 1.6734 1.4103 1.4325 2.3678 5.1278 6.0710 2.4380 1.3574 1.3562 2.2857 2.6107 1.5568 2.0539 1.5718 2.0932 1.1511 1.7595 1.1368 1.1356 2.1613 4.4691 2.3340 3.7911 3.6656 1.3014 1.3988 1.3217 1.2862 1.3875 1.5402 1.2521 10.6706 10.9022 5.8749 6.3612 2.6931 2.6669 1.0721 1.0576 1.1554 1.2263 2.3632 2.3806 6.4922 6.4936 7.0068 6.9711 7.7441 1.0388 1.0625 1.0813 1.0603 1.1005 1.0955 1.1022 1.0999 1.0893 1.0893 1.0933 1.0931 1.0924 1.0928 1.0961 1.0962
irintensity: 2.0809 0.9295 1.0161 5.0787 1.3114 0.6949 0.0911 0.2837 1.2836 2.1058 2.3503 0.7512 0.7140 0.6092 3.7930 1.7962 0.6809 3.6584 1.0506 0.9113 1.7351 1.0826 0.6461 1.2675 0.9906 1.6419 3.4052 8.1269 1.7631 5.4858 2.9930 6.6962 0.3386 1.1377 12.1156 6.4235 6.3910 40.7987 22.7515 19.2658 33.2711 18.7345 7.4829 24.2871 39.2468 2.3599 2.0439 1.7741 4.4166 1.1988 6.6038 14.1124 10.3961 7.9874 0.5077 0.0356 5.8221 1.4068 0.3659 5.5500 2.5749 16.1814 17.8398 34.7004 21.5061 9.4123 34.3473 7.9040 20.3952 150.3284 140.8228 27.4820 165.9722 102.1065 28.1411 5.3323 3.0007 2.4804 12.0926 16.2936 61.8115 104.9633 124.8985 0.9447 0.4801 8.3026 21.2067 13.8934 16.1198 17.8742 18.5444 26.7718 46.5853 3.6373 0.6596 11.0812 7.6842 84.8627 1.3155 18.0449 12.5959 18.2040 7.5172 13.3057 5.1950 12.5143 15.4531 3.7207 10.7229 10.7240 4.3647 5.3337 4.1359 4.0235
temp: 298.150 k
press: 1.00000 atm
elementType: 8 8 8 8 8 7 7 6 6 6 6 6 6 6 6 6 6 6 6 6 6 6 6 6 1 1 1 1 1 1 1 1 1 1 1 1 1 1 1 1
symmnumber: 1
zpe: 789562.9 jmol-1
zpe.correction: 0.300729 hartree
zpe.thermalcorrener: 0.322946 hartree
zpe.thermalcorrenthalpy: 0.323890 hartree
zpe.thermalcorrgfe: 0.243773 hartree
zpe.sumelectzpe: -1141.146158 hartree
zpe.sumelectthermal: -1141.123941 hartree
zpe.sumelectthermalent: -1141.122997 hartree
zpe.sumelectthermalfe: -1141.203113 hartree
dipole: -3.4407 3.3246 7.4764
dipole: 8.8763
quadrupole: -198.3919 -137.9839 -138.4003
quadrupole: -14.5540 -1.2399 -0.0463
quadrupole: -40.1332 20.2748 19.8584 -14.5540 -1.2399 -0.0463
hfenergy: -1141.4468868 hartree
pointgroup: C01 [X(C17H16N2O5)]
dipole: 1.4130298 -1.2017433 2.9588105 debye
polarizability: 279.6078011|26.734008|174.8849332|12.9714747|9.2875519|201.8488387 unknown
InChI: InChI=1S/C17H16N2O5/c1-12(20)15(8-13-4-2-6-16(10-13)18(21)22)9-14-5-3-7-17(11-14)19(23)24/h2-7,10-11,15H,8-9H2,1H3
charge 0 multiplicity 1
40 atoms
O  -1.659047 -2.556563 -1.423182
O  5.964077 2.063646 -0.827098
O  -6.34267 1.541976 0.048551
O  4.560669 1.424056 -2.506745
O  -5.468063 0.249822 -1.613517
N  4.972819 1.375387 -1.284453
N  -5.352368 0.960275 -0.542975
C  -0.076201 -1.425228 0.049554
C  1.310192 -1.991725 -0.428933
C  -0.408463 -0.070752 -0.637901
C  2.488346 -1.159817 0.051927
C  -1.610613 0.625167 -0.016381
C  -1.143931 -2.493161 -0.275873
C  3.176938 -0.293844 -0.828534
C  -2.905116 0.474356 -0.568869
C  2.91801 -1.232489 1.405228
C  -1.455787 1.42977 1.144897
C  -1.517522 -3.462169 0.833549
C  4.259415 0.47081 -0.343054
C  -3.996915 1.120322 0.049001
C  4.004675 -0.460457 1.872563
C  -2.562694 2.068779 1.748295
C  4.692113 0.406812 0.997592
C  -3.85436 1.919258 1.203394
H  -0.033396 -1.289229 1.148676
H  1.41791 -3.029169 -0.055586
H  1.29426 -2.045945 -1.532819
H  0.477931 0.586251 -0.567461
H  -0.596248 -0.27593 -1.707498
H  2.8959 -0.208498 -1.882531
H  -3.071846 -0.135462 -1.461843
H  2.402171 -1.911079 2.095828
H  -0.453785 1.565897 1.570492
H  -2.135754 -2.929492 1.58328
H  -0.621955 -3.83523 1.364714
H  -2.097758 -4.307234 0.432373
H  4.322297 -0.538707 2.917258
H  -2.418547 2.690479 2.637864
H  5.539167 1.015327 1.324128
H  -4.732347 2.401993 1.63979
