program: Gaussian 09
title: 000023631
version: EM64L-G09RevD.01
frameworkgroup: C1[X(C16H17N)]
method: RPBEPBE
basis: SDD
operation: Freq
keyword: #pfreq=noraman
keyword: PBEPBE/SDD
title: #p freq=noraman PBEPBE/SDD
converged: YES YES NO NO
title: Mulliken charges:
elementType: N C C C C C C C C C C C C C C C C H H H H H H H H H H H H H H H H H
charge: -0.094221 -0.259474 -0.409920 -0.422933 -0.516659 0.434593 0.448885 -0.409119 -0.403977 -0.378899 -0.440770 -0.228701 -0.228803 -0.245233 -0.224929 -0.220407 -0.245647 0.256455 0.191991 0.227641 0.234509 0.197685 0.233573 0.188618 0.235309 0.231880 0.267896 0.230608 0.224816 0.224400 0.228138 0.223459 0.223300 0.225934
chargesum: 0.00000
title: Mulliken charges with hydrogens summed into heavy atoms:
elementType: N C C C C C C C C C C C C C C C C
charge: -0.094221 -0.003019 0.009712 0.009261 -0.094469 0.434593 0.448885 -0.173810 -0.172096 -0.111002 -0.210162 -0.003885 -0.004403 -0.017095 -0.001470 0.002893 -0.019713
polarizability: 2.28525380e+02 1.53612322e+01 1.48039691e+02 -1.87048703e+01 4.55163218e-01 1.32932726e+02
1716.lowfreq: -13.7505 -5.5289 -0.0006 -0.0005 -0.0004 6.3808 17.7595 23.8196 32.5254
frequency: 17.5411 23.7626 32.4712 51.6114 97.2329 138.7125 165.3161 199.5422 264.8300 301.2328 325.0004 362.1795 401.8000 405.0114 424.5562 440.8441 467.3301 559.3450 586.4645 615.9498 616.1574 659.2043 704.4929 704.9724 730.7666 752.4298 765.8808 806.3731 851.7962 858.8208 885.0113 888.6919 912.9044 917.1306 962.7594 972.8875 974.5202 982.3430 989.7561 989.9545 992.9234 996.9651 999.9769 1024.8159 1029.0103 1069.2322 1076.9559 1087.8344 1090.0877 1097.2533 1139.7909 1169.3629 1171.6666 1176.3342 1179.9202 1189.1177 1213.2006 1221.7524 1225.3212 1229.0100 1259.2721 1287.8663 1311.2098 1317.8195 1337.1312 1352.8430 1375.5949 1387.0177 1433.4674 1439.2057 1458.2011 1471.0175 1481.3040 1486.9038 1489.6369 1588.4801 1593.7391 1614.3460 1616.1498 2841.0845 2912.1803 2925.6940 2980.1887 3006.3890 3042.8309 3055.8016 3112.0473 3117.2486 3120.1651 3122.2798 3133.7053 3135.7254 3143.8224 3148.6335 3161.1317 3162.0062
redmass: 3.7628 4.6303 4.1442 3.3559 4.3740 3.0497 3.6243 3.8805 4.4579 3.6732 2.1511 3.2961 2.8224 2.8517 3.1740 3.5475 2.9724 2.4711 5.0185 6.4294 6.3175 4.8457 1.8335 2.2124 2.0572 1.7434 2.0645 3.9297 1.2469 1.2504 3.1002 1.1892 1.3618 1.5713 2.2942 2.6304 1.3905 1.3849 6.0190 6.1304 1.3088 2.8365 1.5888 2.1818 2.0520 2.7126 1.6248 1.6263 1.8298 1.1851 1.3200 1.0654 1.0517 3.1626 1.1156 1.1244 2.4808 1.1973 1.2873 1.5246 1.3807 1.6172 1.3999 1.3569 2.0756 1.6402 7.4259 4.9406 2.2580 2.1130 1.1198 1.0791 2.1942 2.4177 1.1262 6.1158 6.1895 6.1353 6.0923 1.0703 1.0656 1.0684 1.0862 1.0831 1.0963 1.0980 1.0866 1.0852 1.0870 1.0865 1.0915 1.0920 1.0962 1.0952 1.1012 1.1015
irintensity: 0.0026 0.0742 0.0204 0.3747 0.3136 0.6587 2.3991 2.8819 0.0300 0.9876 7.9783 1.3400 0.0458 0.2694 3.1109 2.2378 14.4401 10.3896 1.6386 0.1253 0.1711 3.9093 47.7272 32.0070 44.5098 49.0889 38.0497 2.7142 0.0242 0.2904 2.1084 2.6261 3.9137 2.7750 8.9365 4.1717 0.0133 0.2533 0.0454 0.0506 0.2003 2.8902 1.1205 15.5877 7.4734 0.9954 11.1095 4.9667 0.3932 6.2213 3.3098 0.1898 0.0837 36.9198 1.4424 0.2375 7.6783 2.4863 10.6795 3.3737 14.8159 9.6649 4.3335 0.2369 4.0080 14.1647 0.1671 6.2136 6.0112 12.1828 12.9646 0.2647 15.2973 20.1240 8.5405 1.9457 1.2319 13.0466 12.9790 72.2958 64.1223 72.8346 23.9721 7.4996 52.1523 39.7966 8.6102 9.5512 1.9856 0.7707 16.4323 25.8339 45.5143 29.5941 29.0298 20.9222
temp: 298.150 k
press: 1.00000 atm
elementType: 7 6 6 6 6 6 6 6 6 6 6 6 6 6 6 6 6 1 1 1 1 1 1 1 1 1 1 1 1 1 1 1 1 1
symmnumber: 1
zpe: 745334.9 jmol-1
zpe.correction: 0.283883 hartree
zpe.thermalcorrener: 0.298406 hartree
zpe.thermalcorrenthalpy: 0.299351 hartree
zpe.thermalcorrgfe: 0.239198 hartree
zpe.sumelectzpe: -673.396378 hartree
zpe.sumelectthermal: -673.381854 hartree
zpe.sumelectthermalent: -673.380910 hartree
zpe.sumelectthermalfe: -673.441063 hartree
dipole: -0.7937 0.1205 0.6275
dipole: 1.0190
quadrupole: -96.8612 -96.7213 -98.6757
quadrupole: 3.7803 -2.1882 -0.9776
quadrupole: 0.5582 0.6981 -1.2563 3.7803 -2.1882 -0.9776
hfenergy: -673.6802608 hartree
pointgroup: C01 [X(C16H17N1)]
dipole: 0.3220446 -0.0909871 0.2207451 debye
polarizability: 228.5674565|13.9452078|148.4224024|19.2056103|3.5713241|132.5079376 unknown
InChI: InChI=1S/C16H17N/c1-3-7-14(8-4-1)11-17-12-16(13-17)15-9-5-2-6-10-15/h1-10,16H,11-13H2
charge 0 multiplicity 1
34 atoms
N  -0.616791 1.048287 0.05476
C  1.394417 0.855381 -0.66797
C  0.678822 1.72018 0.430683
C  0.135346 -0.078397 -0.610056
C  -1.57632 0.727007 1.124439
C  2.769565 0.284426 -0.392214
C  -2.860058 0.098824 0.587995
C  3.117451 -1.02087 -0.826356
C  3.754728 1.061138 0.271738
C  -3.381544 0.488243 -0.671584
C  -3.566582 -0.860998 1.354514
C  4.415018 -1.535909 -0.606929
C  5.052827 0.549526 0.493552
C  5.388961 -0.752166 0.054032
C  -4.590777 -0.063836 -1.149321
C  -4.779813 -1.411627 0.880772
C  -5.296644 -1.013961 -0.373909
H  1.402649 1.407783 -1.626582
H  1.036417 1.448446 1.450986
H  0.676569 2.81816 0.316518
H  -0.305367 -0.427663 -1.558819
H  0.299397 -0.948285 0.067037
H  -1.817575 1.68056 1.638795
H  -1.13198 0.050278 1.899529
H  2.368731 -1.637313 -1.33866
H  3.503551 2.071683 0.617048
H  -2.819724 1.219545 -1.262873
H  -3.165629 -1.179832 2.325302
H  4.665222 -2.546689 -0.949126
H  5.800276 1.163658 1.008949
H  6.394897 -1.150828 0.226712
H  -4.983291 0.245331 -2.12515
H  -5.315936 -2.152476 1.485117
H  -6.234813 -1.442603 -0.744528
