program: Gaussian 09
title: 000260375
version: EM64L-G09RevD.01
frameworkgroup: C1[X(C20H16O)]
method: RPBEPBE
basis: SDD
operation: Freq
keyword: #pfreq=noraman
keyword: PBEPBE/SDD
title: #p freq=noraman PBEPBE/SDD
converged: NO YES NO NO
title: Mulliken charges:
elementType: O C C C C C C C C C C C C C C C C C C C C H H H H H H H H H H H H H H H H
charge: -0.473910 -0.109593 0.204390 0.197113 -0.755337 0.282082 0.280437 0.419963 -0.363990 -0.365081 -0.395595 -0.396547 -0.377371 -0.422747 -0.242006 -0.241659 -0.246831 -0.246519 -0.228663 -0.217100 -0.248068 0.235182 0.246157 0.274538 0.276160 0.235803 0.236137 0.348550 0.226256 0.285347 0.227814 0.228076 0.227788 0.227721 0.222689 0.222977 0.225835
chargesum: 0.00000
title: Mulliken charges with hydrogens summed into heavy atoms:
elementType: O C C C C C C C C C C C C C C C C C C C C
charge: -0.125360 -0.109593 0.204390 0.197113 -0.273998 0.282082 0.280437 0.419963 -0.089452 -0.088922 -0.159791 -0.160410 -0.151114 -0.137400 -0.014192 -0.013583 -0.019043 -0.018798 -0.005974 0.005878 -0.022233
polarizability: 2.26021270e+02 1.36443983e-01 2.23702023e+02 1.81751628e+01 -2.16220169e+01 1.67578489e+02
1716.lowfreq: -26.7917 -16.5573 -7.9304 -0.0007 -0.0006 0.0001 9.4525 36.7397 51.4754
frequency: -26.4343 36.6771 51.4505 67.5485 112.5461 174.7089 200.9860 206.8475 236.5092 256.6600 299.1519 302.5966 338.8298 354.6614 369.7518 397.5329 399.8381 427.4886 449.3905 452.4533 487.3446 539.6292 564.4078 570.9534 616.1074 624.4209 629.7585 635.7341 681.2870 699.9659 717.8637 735.8569 757.4709 758.8807 771.6210 807.5963 832.3418 848.8567 862.5136 876.2089 886.9208 902.8688 935.9866 936.4032 957.0058 961.4885 971.1614 977.3970 989.7965 990.3354 990.6541 998.5531 1027.4756 1037.5571 1043.8444 1082.6901 1084.9189 1123.4980 1148.0553 1168.0784 1170.9714 1172.7487 1174.1084 1184.1022 1189.0437 1203.7742 1206.5911 1216.7256 1257.4252 1278.8356 1291.2771 1322.5553 1331.7184 1381.5553 1383.1087 1386.1985 1433.1826 1434.6864 1441.7483 1445.6175 1477.9457 1479.0268 1486.2106 1582.0519 1592.0459 1600.6747 1609.3583 1610.6318 1617.2619 2936.8553 3014.6261 3114.5576 3114.8819 3122.2438 3131.6201 3133.0036 3133.2922 3145.1821 3149.6847 3150.2650 3160.5495 3164.9256 3165.5149 3180.3477 3559.9497
redmass: 3.7571 3.7922 5.1193 4.7827 3.7851 2.9387 4.3249 4.8397 3.3785 4.2348 3.4154 3.9634 5.9335 1.4557 5.1172 3.2790 3.2058 3.4180 3.1648 3.6206 3.5400 3.8328 5.2650 4.8460 6.4124 5.2063 6.2121 5.6234 6.0568 1.7899 2.5218 2.9071 1.5406 1.5913 1.7093 3.8941 4.0172 1.2668 1.3963 1.3594 3.2441 2.4371 2.1518 1.9820 1.3960 4.5031 1.8563 1.3743 1.9314 1.6460 1.8273 1.3215 2.2382 2.4588 2.0666 1.6195 2.3668 2.0311 2.0254 2.3151 1.0567 1.0648 1.1310 1.1506 1.1521 2.7254 1.6085 1.7142 2.4969 1.4675 1.6646 1.3691 1.9515 8.3322 5.5983 10.1896 2.2103 2.1459 2.5109 1.1688 2.4955 2.2578 2.4000 6.8679 6.3329 7.3333 6.3129 6.1599 6.4521 1.0685 1.0899 1.0875 1.0875 1.0843 1.0884 1.0884 1.0883 1.0938 1.0936 1.0937 1.0992 1.0999 1.0998 1.0949 1.0657
irintensity: 0.0104 0.1082 0.0940 0.1560 0.6141 1.8685 0.6687 0.2615 2.1514 0.1570 5.8237 6.5471 1.0095 129.8107 1.6788 3.3562 29.9684 9.3401 4.4692 4.1860 1.2320 0.0259 1.1908 4.3993 0.0905 20.3062 19.1460 10.9675 3.4569 50.0851 36.5676 13.9396 47.9292 80.9302 25.1754 7.1954 0.6057 0.1324 7.8628 0.1423 19.5443 13.4693 1.5168 3.3479 0.6464 39.5005 22.9765 0.0501 0.1740 0.1841 0.2124 0.2917 9.8178 2.0058 8.3971 2.6632 2.5120 4.6503 37.8815 0.6270 0.3626 0.7820 0.6808 1.7247 3.1717 0.2381 0.4740 1.2770 19.6022 0.9018 21.1933 24.9415 0.2546 1.3774 0.6409 0.0322 5.8355 16.0351 1.3826 26.6482 42.5373 23.3396 1.8688 4.2330 0.5217 1.4519 2.1768 8.2534 0.0129 15.2407 18.4414 1.2717 14.9641 1.6450 8.2225 7.8605 13.9507 39.6645 19.4510 23.7716 25.6278 49.8778 3.6805 6.5690 10.0998
temp: 298.150 k
press: 1.00000 atm
elementType: 8 6 6 6 6 6 6 6 6 6 6 6 6 6 6 6 6 6 6 6 6 1 1 1 1 1 1 1 1 1 1 1 1 1 1 1 1
symmnumber: 1
zpe: 775825.0 jmol-1
zpe.correction: 0.295496 hartree
zpe.thermalcorrener: 0.310994 hartree
zpe.thermalcorrenthalpy: 0.311938 hartree
zpe.thermalcorrgfe: 0.252981 hartree
zpe.sumelectzpe: -845.525825 hartree
zpe.sumelectthermal: -845.510327 hartree
zpe.sumelectthermalent: -845.509383 hartree
zpe.sumelectthermalfe: -845.568340 hartree
dipole: -1.0211 1.3205 -0.8176
dipole: 1.8587
quadrupole: -114.1541 -114.0546 -115.5856
quadrupole: -1.2684 2.8112 -3.0388
quadrupole: 0.4440 0.5435 -0.9875 -1.2684 2.8112 -3.0388
hfenergy: -845.8213211 hartree
pointgroup: C01 [X(C20H16O1)]
dipole: -0.0645812 -0.6499761 -0.3288362 debye
polarizability: 225.1193807|-0.533628|223.8887444|0.0725046|28.9676776|168.2936568 unknown
InChI: InChI=1S/C20H16O/c21-20(17-10-2-1-3-11-17)18-12-6-4-8-15(18)14-16-9-5-7-13-19(16)20/h1-13,21H,14H2
charge 0 multiplicity 1
37 atoms
O  0.099664 0.41913 2.244449
C  0.049725 0.161107 0.776231
C  -1.303118 -0.490869 0.438881
C  1.245522 -0.727805 0.393444
C  -0.197557 -2.110011 -1.209845
C  -1.415507 -1.557929 -0.488189
C  1.126554 -1.792514 -0.535054
C  0.164313 1.551983 0.113534
C  -2.470826 0.015844 1.06745
C  2.507713 -0.447808 0.980119
C  -2.695936 -2.108213 -0.755262
C  2.274153 -2.566429 -0.848114
C  0.208678 1.651674 -1.299911
C  0.21905 2.734004 0.889282
C  -3.737965 -0.531123 0.789271
C  3.642202 -1.216503 0.657057
C  -3.852295 -1.603352 -0.128707
C  3.524996 -2.285748 -0.264106
C  0.303986 2.911589 -1.927794
C  0.315903 3.996624 0.259007
C  0.35801 4.092052 -1.149598
H  -0.300633 -3.205038 -1.332055
H  -0.17955 -1.701226 -2.243881
H  -2.364669 0.842231 1.777111
H  2.578805 0.380378 1.69223
H  -2.780287 -2.942305 -1.463103
H  2.178849 -3.397875 -1.557684
H  0.028204 -0.459564 2.697656
H  0.172584 0.745829 -1.915301
H  0.187314 2.652462 1.978383
H  -4.630328 -0.128531 1.280902
H  4.61018 -0.987727 1.116144
H  -4.832257 -2.040873 -0.349182
H  4.399664 -2.894079 -0.519662
H  0.337428 2.97374 -3.02143
H  0.35858 4.904935 0.871037
H  0.43305 5.070842 -1.636509
