program: Gaussian 09
title: 000260374
version: EM64L-G09RevD.01
frameworkgroup: C1[X(C16H27NO)]
method: RPBEPBE
basis: SDD
operation: Freq
keyword: #p
keyword: freq=noraman
keyword: PBEPBE/SDD
title: #p freq=noraman PBEPBE/SDD
converged: YES YES NO NO
title: Mulliken charges:
elementType: O N C C C C C C C C C C C C C C C C H H H H H H H H H H H H H H H H H H H H H H H H H H H
charge: -0.268758 -0.313019 0.008222 -0.434800 -0.455634 -0.375867 -0.372792 -0.353821 -0.724815 -0.477186 -0.698049 0.430317 -0.423273 -0.389178 -0.352033 -0.349063 0.317073 -0.538281 0.173495 0.192254 0.196082 0.198631 0.214760 0.217494 0.187108 0.190071 0.202359 0.194956 0.194822 0.255445 0.214057 0.206294 0.221867 0.191750 0.218973 0.209610 0.216233 0.209906 0.232661 0.266073 0.247214 0.236713 0.242975 0.219946 0.219211
chargesum: 0.00000
title: Mulliken charges with hydrogens summed into heavy atoms:
elementType: O N C C C C C C C C C C C C C C C C
charge: -0.268758 -0.057574 0.181717 -0.046464 -0.042242 0.028734 0.019638 0.035957 -0.082597 -0.066464 -0.062300 0.430317 -0.190612 -0.123105 -0.104820 -0.112351 0.317073 0.143851
polarizability: 2.25853067e+02 1.28773890e+01 1.66800296e+02 1.75477381e+01 -1.37676371e+01 1.64882376e+02
1716.lowfreq: -9.7784 -7.7465 -0.0007 -0.0004 0.0004 5.4790 7.7489 20.7753 36.0901
frequency: 3.0144 20.0260 36.0416 39.9573 44.6100 71.4576 83.5176 95.2745 103.1260 118.8268 149.6078 156.8905 189.4419 218.6183 225.3601 234.8258 240.9541 263.8042 272.0707 294.3909 327.1583 336.6400 364.0841 416.9258 443.6083 459.6553 487.5688 509.5645 533.1541 580.9645 630.9281 686.0329 709.2192 726.1714 731.9819 763.8924 781.7151 815.8996 819.9822 826.0562 835.6937 892.2055 902.2754 919.2690 942.9080 958.2348 967.3044 979.0114 989.0264 1002.3505 1009.1559 1034.1397 1036.1596 1053.7103 1080.1145 1086.9454 1099.9546 1111.9158 1112.1652 1135.8268 1147.6737 1156.1276 1169.5007 1171.0918 1196.2646 1209.8105 1213.2735 1227.7266 1238.7238 1254.6612 1266.5196 1271.5020 1287.3143 1292.8411 1297.7079 1317.6425 1331.8382 1346.2809 1351.0739 1356.1158 1371.5151 1385.9657 1388.2612 1394.3734 1415.0950 1435.7297 1444.0201 1458.0028 1464.2009 1466.0977 1471.6972 1473.7392 1474.0152 1476.1451 1478.4894 1481.8126 1486.7504 1488.9860 1500.5888 1502.5106 1585.9545 1623.4964 2850.9880 2864.9956 2943.0545 2949.8718 2955.4351 2956.4450 2963.6673 2966.7342 2970.2538 2971.5192 2972.9954 2988.2473 3004.1626 3006.5770 3027.1863 3032.0182 3042.6979 3064.7579 3067.6834 3070.5429 3072.2343 3119.3690 3121.9546 3138.9246 3159.7180 3164.6991 3442.1365
redmass: 3.5958 3.4048 3.7215 3.3548 2.5244 1.6851 2.5757 2.7245 3.1353 2.5429 3.1598 1.8011 2.5789 3.0574 1.2382 1.2548 1.2849 2.3644 3.6110 3.4269 2.4741 2.9708 3.7904 2.9827 2.6679 3.8193 2.5545 2.8411 3.9347 2.4373 6.3882 1.3422 3.2392 1.0888 3.7852 1.1860 1.9904 2.1824 1.4538 1.3755 2.0561 1.7967 2.1318 1.2717 1.3614 1.7819 1.3573 1.6588 8.4427 2.6887 2.3206 1.5085 1.8107 2.5162 2.5861 2.0265 1.8291 1.2637 1.5963 2.0012 2.1266 1.3477 2.5403 1.2697 1.2727 2.0777 1.4306 4.0381 1.2760 1.2874 1.2419 1.2045 1.1483 1.1593 1.2883 1.3788 1.4424 1.5400 1.6153 1.4734 1.9220 1.2864 1.2168 2.2245 3.0880 1.1735 1.1843 1.0871 1.0732 1.0503 1.0720 1.0712 1.0630 1.0449 1.0912 1.0709 1.0751 1.0897 1.4648 1.4626 7.1635 6.4082 1.0715 1.0722 1.0802 1.0616 1.0602 1.0331 1.0855 1.0590 1.0407 1.0365 1.0572 1.0973 1.0921 1.0942 1.1007 1.1022 1.1037 1.0991 1.1006 1.0993 1.0998 1.0894 1.0991 1.0875 1.0952 1.0953 1.0737
irintensity: 0.0430 0.4522 0.0984 0.5383 0.5016 0.1766 7.4673 0.7565 0.2852 0.2228 2.0415 2.2959 0.1734 0.9556 0.3370 0.0712 0.3656 0.1962 1.3280 0.3775 1.4298 4.8861 2.2511 0.4203 0.1416 1.7466 2.2573 16.2254 13.3380 8.4646 3.4276 67.2214 11.6349 4.9087 6.6131 12.6152 5.9464 26.9375 16.2986 6.7059 32.4998 6.6544 3.2291 7.3824 3.7273 3.3592 1.1203 3.6759 44.4594 11.0084 7.9499 0.9954 5.4198 1.6948 2.4622 17.5672 37.8639 0.2184 8.8518 3.2860 6.4757 0.3547 36.3068 37.0868 4.6369 31.9446 5.0296 145.5061 4.1175 2.6142 6.0947 1.8984 1.6219 0.1722 9.1167 11.2173 6.5373 8.5372 0.1627 6.4418 5.1273 15.8223 12.2476 6.3188 0.8119 13.6533 48.8740 12.3258 2.8696 12.8776 3.5273 22.2992 37.7631 17.0705 15.2999 3.0088 16.7689 22.9047 41.5056 78.4308 9.0330 40.6459 60.6560 142.6717 22.6721 8.7694 15.6039 66.8275 27.7742 63.0780 74.0399 40.3232 38.6386 4.5636 33.2960 22.7645 2.0884 101.3109 51.8100 54.8762 89.4528 51.9725 78.5655 17.5451 28.3548 5.1320 16.1807 6.0055 0.7138
temp: 298.150 k
press: 1.00000 atm
elementType: 8 7 6 6 6 6 6 6 6 6 6 6 6 6 6 6 6 6 1 1 1 1 1 1 1 1 1 1 1 1 1 1 1 1 1 1 1 1 1 1 1 1 1 1 1
symmnumber: 1
zpe: 1042075.3 jmol-1
zpe.correction: 0.396906 hartree
zpe.thermalcorrener: 0.418007 hartree
zpe.thermalcorrenthalpy: 0.418952 hartree
zpe.thermalcorrgfe: 0.342163 hartree
zpe.sumelectzpe: -754.423910 hartree
zpe.sumelectthermal: -754.402808 hartree
zpe.sumelectthermalent: -754.401864 hartree
zpe.sumelectthermalfe: -754.478653 hartree
dipole: 0.6652 0.2347 -0.9976
dipole: 1.2218
quadrupole: -107.2425 -115.1611 -105.8654
quadrupole: -3.3230 10.0494 -2.1640
quadrupole: 2.1805 -5.7381 3.5576 -3.3230 10.0494 -2.1640
hfenergy: -754.8208158 hartree
pointgroup: C01 [X(C16H27N1O1)]
dipole: 0.2529986 0.1031291 -0.3955191 debye
polarizability: 227.0577504|11.05917|167.4870685|16.1846326|-14.1962204|162.9909203 unknown
InChI: InChI=1S/C16H27NO/c1-4-6-7-14(5-2)12-17-13-15-8-10-16(18-3)11-9-15/h8-11,14,17H,4-7,12-13H2,1-3H3
charge 0 multiplicity 1
45 atoms
O  -5.469791 -0.741848 -0.360782
N  0.834416 0.539915 0.659793
C  3.157385 1.274421 0.01451
C  3.441901 0.047809 -0.898465
C  2.163143 0.951578 1.161059
C  2.69308 2.484282 -0.841832
C  3.97255 -1.209921 -0.172565
C  4.3754 -2.340626 -1.147288
C  2.631691 3.82461 -0.077478
C  -0.193858 0.362743 1.708111
C  4.89088 -3.604708 -0.426045
C  -1.568022 0.066004 1.118247
C  -2.454197 -0.838366 1.759751
C  -2.006893 0.708742 -0.063464
C  -3.742634 -1.08411 1.248542
C  -3.2945 0.471261 -0.596041
C  -4.167514 -0.4270 0.067345
C  -5.955838 -0.086803 -1.575985
H  4.116311 1.550041 0.508114
H  2.525391 -0.212054 -1.470127
H  4.18818 0.355198 -1.660235
H  2.620724 0.188507 1.839425
H  2.019481 1.85914 1.779503
H  1.693596 2.253572 -1.258875
H  3.387159 2.590152 -1.700723
H  4.850707 -0.933087 0.447925
H  3.20895 -1.60164 0.530463
H  5.156302 -1.963457 -1.839004
H  3.503006 -2.604194 -1.780133
H  0.888724 -0.288986 0.051972
H  2.380222 4.657192 -0.760366
H  3.603853 4.060257 0.397263
H  1.861652 3.806417 0.714985
H  0.064075 -0.436599 2.448237
H  -0.230323 1.310379 2.286227
H  4.116593 -4.022546 0.245116
H  5.175409 -4.394531 -1.145451
H  5.779414 -3.373885 0.191646
H  -2.132859 -1.356908 2.671823
H  -1.318685 1.396418 -0.566662
H  -4.430738 -1.779718 1.738714
H  -3.601582 0.98455 -1.512657
H  -6.977795 -0.46782 -1.719495
H  -5.981882 1.014482 -1.458955
H  -5.333686 -0.349763 -2.454145
