program: Gaussian 09
title: 000260424
version: EM64L-G09RevD.01
frameworkgroup: C1[X(C20H20O5)]
method: RPBEPBE
basis: SDD
operation: Freq
keyword: #pfreq=noraman
keyword: PBEPBE/SDD
title: #p freq=noraman PBEPBE/SDD
converged: YES YES NO NO
title: Mulliken charges:
elementType: O O O O O C C C C C C C C C C C C C C C C C C C C H H H H H H H H H H H H H H H H H H H H
charge: -0.440244 -0.264643 -0.283397 -0.183193 -0.236512 -0.239398 -0.555569 0.424493 0.286594 -0.639357 -0.397467 -0.399110 0.181164 -0.628455 -0.339626 -0.351373 0.342567 0.144988 0.308815 -0.331163 -0.335103 -0.248907 -0.244668 -0.222525 -0.544717 0.244626 0.226717 0.266735 0.320292 0.276622 0.266341 0.222738 0.267765 0.301741 0.248866 0.238951 0.367155 0.248027 0.296373 0.233485 0.241352 0.235245 0.242426 0.221640 0.229708
chargesum: 0.00000
title: Mulliken charges with hydrogens summed into heavy atoms:
elementType: O O O O O C C C C C C C C C C C C C C C C C C C C
charge: -0.073088 -0.264643 -0.283397 -0.183193 -0.236512 0.005229 -0.062116 0.424493 0.286594 -0.042443 -0.131126 -0.176372 0.181164 -0.058949 -0.090760 -0.112422 0.342567 0.144988 0.308815 -0.083136 -0.038730 -0.015422 -0.003316 0.012720 0.149057
polarizability: 2.61858939e+02 -2.50049770e+01 2.13709556e+02 -2.92476128e+01 -1.75859699e+01 1.92148205e+02
1716.lowfreq: -5.5283 -4.3666 0.0004 0.0005 0.0006 4.7106 20.2988 21.7181 30.5992
frequency: 20.1766 21.6713 30.4395 35.0611 52.1823 55.0277 66.5283 80.9840 88.1022 123.4556 132.3160 144.1231 156.1766 169.5741 208.6952 226.7245 235.0658 248.4329 263.7726 294.1277 305.9923 334.7027 357.0448 400.7461 408.1857 411.7436 416.3195 437.0410 443.6870 463.1499 473.0484 494.2294 524.1808 547.0785 565.3805 585.2851 608.1534 613.2393 632.6135 653.7769 666.1514 695.5918 706.0805 760.6668 763.2048 774.4208 789.0628 802.7907 812.0149 842.2687 854.7163 859.3713 871.3553 925.6809 933.0960 944.4181 967.0399 975.8724 979.9901 986.2378 988.0117 989.4276 993.1383 1003.2106 1012.6781 1016.2357 1027.9393 1087.2718 1091.0239 1111.9289 1112.5281 1117.0485 1155.5472 1156.1517 1173.9640 1175.3526 1182.2570 1191.8230 1196.0164 1212.0566 1220.1238 1228.2417 1256.8097 1288.1540 1293.7795 1297.6788 1308.1822 1323.2659 1335.0643 1375.0601 1388.4321 1396.5990 1397.9013 1408.5814 1413.7485 1435.2376 1435.5620 1439.5431 1467.5302 1474.6667 1480.4951 1498.4743 1563.9271 1585.6719 1589.9532 1596.9043 1610.5917 1621.4943 1632.3366 2930.8630 2961.1467 2969.9015 3002.9833 3022.7204 3043.3613 3050.1117 3056.9482 3078.9864 3108.6403 3123.6157 3131.0257 3142.3355 3151.1222 3153.6489 3160.5390 3164.0366 3171.7415 3172.9209 3387.7670
redmass: 5.5060 6.0091 5.7449 3.9782 6.1360 4.7894 6.4162 5.4523 6.4116 4.9795 4.1476 5.4674 4.8825 4.5407 3.6518 1.7529 3.3806 3.9523 2.3937 4.2633 4.9555 4.2857 3.0521 2.8163 3.5299 3.5231 3.6451 3.9944 6.6451 2.3115 4.0567 4.4771 2.7846 2.7217 3.8248 1.1684 4.2866 6.3084 6.3570 4.3499 4.7016 1.8230 3.2662 3.1512 3.7756 2.1624 3.2632 3.7671 1.5598 2.1319 1.9747 1.3333 2.5359 1.9125 1.5347 1.9884 2.2055 2.4207 1.5884 5.2581 3.7733 5.3092 1.4974 2.8926 1.4172 2.6144 1.9961 2.0698 1.6270 1.3129 1.2615 1.3557 1.3871 1.3348 1.2951 1.1737 1.4775 1.1292 1.2818 1.5951 2.2754 3.2080 2.1259 1.4703 1.6820 1.9803 1.4251 1.3598 1.6269 3.9794 8.9719 1.1545 1.2301 1.1242 3.6119 1.1713 2.2509 1.1091 1.0501 1.0784 2.1841 2.3949 7.0424 7.2579 6.7743 6.6805 6.2091 6.3729 9.3228 1.0664 1.0327 1.0623 1.0621 1.0846 1.0907 1.1041 1.0950 1.1003 1.0889 1.0997 1.0854 1.0885 1.0877 1.0929 1.0936 1.0961 1.0969 1.1000 1.0660
irintensity: 0.7201 1.2949 1.3285 0.7423 0.1797 0.9579 3.7050 3.3859 2.9630 1.9770 10.7317 3.4141 1.2217 2.1756 9.9744 11.4179 9.0838 6.4332 4.0553 3.8717 0.8002 2.4121 1.0069 0.3803 0.0954 0.6812 1.7875 3.6302 0.3285 5.6672 2.6727 13.9187 20.1474 21.8591 12.9323 158.4681 13.3205 0.8416 5.5185 15.1453 5.5611 52.3697 6.7214 15.6451 8.1711 37.1380 24.9591 3.3111 14.7907 20.5846 41.5511 3.9692 8.5671 4.7293 1.1786 4.2008 0.5553 47.9919 10.1157 21.4772 13.6725 6.9756 2.0077 31.0101 3.3728 30.1937 1.3550 91.5844 11.9214 4.2522 0.5435 11.1642 28.1597 2.1838 36.3678 19.6075 16.7429 15.8167 23.7313 3.0449 120.5617 155.1374 86.5520 14.2179 80.8984 136.6222 19.5282 23.1853 98.4919 4.4021 4.5788 109.4339 36.9029 60.5509 0.4943 5.7238 20.5821 20.6390 13.1505 49.0393 1.4434 81.1557 92.2786 1.9968 31.6344 87.9144 14.6672 46.3493 185.8028 40.9581 63.2995 22.0945 7.0240 29.1415 3.1081 48.4756 3.1272 11.3137 21.0788 20.6612 0.0666 8.2225 3.0171 19.3463 14.0787 10.2832 0.7610 21.9877 79.9994
temp: 298.150 k
press: 1.00000 atm
elementType: 8 8 8 8 8 6 6 6 6 6 6 6 6 6 6 6 6 6 6 6 6 6 6 6 6 1 1 1 1 1 1 1 1 1 1 1 1 1 1 1 1 1 1 1 1
symmnumber: 1
zpe: 924595.5 jmol-1
zpe.correction: 0.352160 hartree
zpe.thermalcorrener: 0.375832 hartree
zpe.thermalcorrenthalpy: 0.376776 hartree
zpe.thermalcorrgfe: 0.296431 hartree
zpe.sumelectzpe: -1148.408152 hartree
zpe.sumelectthermal: -1148.384480 hartree
zpe.sumelectthermalent: -1148.383535 hartree
zpe.sumelectthermalfe: -1148.463881 hartree
dipole: -2.0270 2.1611 -1.2828
dipole: 3.2287
quadrupole: -126.7854 -148.8800 -154.5951
quadrupole: 3.0431 -15.7765 -20.6591
quadrupole: 16.6348 -5.4598 -11.1750 3.0431 -15.7765 -20.6591
hfenergy: -1148.7603118 hartree
pointgroup: C01 [X(C20H20O5)]
dipole: 1.0199059 0.5371344 0.5337472 debye
polarizability: 263.8948907|21.7700436|194.584842|-28.348021|21.2569319|209.2369682 unknown
InChI: InChI=1S/C20H20O5/c1-25-18-9-7-15(8-10-18)20(24)13-17(22)11-16(21)12-19(23)14-5-3-2-4-6-14/h2-10,20,24H,11-13H2,1H3
charge 0 multiplicity 1
45 atoms
O  -3.435256 1.505355 -1.88173
O  -2.519253 -1.043367 -1.145449
O  2.120516 3.010005 1.086438
O  -1.660159 -3.780482 1.532471
O  0.73875 -0.767859 1.406665
C  -3.298982 1.71131 -0.443254
C  -3.756913 0.422424 0.332794
C  -1.880796 2.131791 -0.026469
C  -2.801301 -0.734495 0.053654
C  -2.181747 -1.43056 1.258986
C  -0.827369 2.185655 -0.973098
C  -1.590595 2.44999 1.321943
C  -1.359001 -2.687316 0.986163
C  -0.174148 -2.582807 0.032271
C  0.486286 2.497401 -0.5760
C  -0.278717 2.766111 1.738957
C  0.768413 2.765078 0.78521
C  0.87252 -1.510455 0.387936
C  2.055547 -1.364067 -0.520891
C  2.313668 -2.268463 -1.587486
C  2.939504 -0.269585 -0.307311
C  3.440789 -2.088488 -2.416089
C  4.060602 -0.089069 -1.140244
C  4.316978 -1.000007 -2.194067
C  2.457103 3.29317 2.484714
H  -4.016887 2.516837 -0.202105
H  -3.824737 0.623763 1.415017
H  -4.764883 0.152804 -0.038025
H  -1.498677 -0.688172 1.732768
H  -2.972395 -1.668538 1.99488
H  -1.051489 1.989449 -2.025817
H  -2.393896 2.452612 2.070517
H  0.306812 -3.576237 -0.023152
H  -0.583148 -2.340973 -0.971535
H  1.306637 2.527936 -1.299841
H  -0.087037 2.989432 2.792462
H  -3.083371 0.591054 -2.085649
H  1.643294 -3.11342 -1.774248
H  2.720151 0.433278 0.50265
H  3.636838 -2.791766 -3.232557
H  4.729996 0.761564 -0.973795
H  5.190811 -0.860261 -2.840352
H  3.546489 3.445411 2.493782
H  1.950923 4.211139 2.841677
H  2.192235 2.442117 3.14151
