program: Gaussian 09
title: 000260372
version: EM64L-G09RevD.01
frameworkgroup: C1[X(C16H19NO2S)]
method: RPBEPBE
basis: SDD
operation: Freq
keyword: #p
keyword: freq=noraman
keyword: PBEPBE/SDD
title: #p freq=noraman PBEPBE/SDD
converged: YES YES NO NO
title: Mulliken charges:
elementType: S O O N C C C C C C C C C C C C C C C C H H H H H H H H H H H H H H H H H H H
charge: 0.953393 -0.530724 -0.516379 -0.541017 0.130555 0.506009 -0.693668 -0.691466 -0.743841 -0.379515 -0.396520 -0.105832 -0.250824 -0.284290 0.367851 -0.328852 -0.376086 -0.211665 -0.196874 -0.242847 0.213951 0.217560 0.223485 0.216288 0.213175 0.226924 0.222392 0.216542 0.219208 0.241679 0.261596 0.280798 0.284239 0.286634 0.290462 0.224989 0.232848 0.228298 0.231526
chargesum: 0.00000
title: Mulliken charges with hydrogens summed into heavy atoms:
elementType: S O O N C C C C C C C C C C C C C C C C
charge: 0.953393 -0.530724 -0.516379 -0.254383 0.130555 0.506009 -0.038672 -0.035079 -0.085700 -0.137836 -0.134924 -0.105832 0.029974 -0.000051 0.367851 -0.038390 -0.151097 0.021183 0.031423 -0.011322
polarizability: 2.42667612e+02 8.04514398e+00 2.38015440e+02 1.63930510e+01 1.25645045e+01 1.77216249e+02
1716.lowfreq: -6.9279 0.0011 0.0018 0.0021 6.9419 8.7062 18.0593 21.2340 34.9904
frequency: 17.4529 21.2149 34.9450 55.8495 65.2249 95.9977 109.1694 112.7361 183.1088 189.5188 200.4868 210.0892 214.3797 231.0995 258.0298 284.8190 306.5969 311.8314 335.9505 351.1832 357.2265 377.2775 404.9940 410.1679 424.1091 428.3891 457.8257 463.2300 504.5296 547.3770 555.9469 563.4902 612.3673 620.1847 691.7625 707.6948 735.5187 761.0691 789.0335 818.1251 820.1711 830.8905 841.8011 847.9502 849.3720 913.6289 920.6398 932.9684 944.3579 957.5840 968.7519 972.2640 982.2730 984.0426 990.0962 993.8448 1020.1814 1022.6575 1027.7931 1051.2256 1079.6014 1104.0650 1119.3022 1171.8687 1183.0509 1193.5686 1203.5203 1215.2212 1228.1516 1241.7633 1269.3056 1299.1231 1334.2558 1370.7673 1378.2175 1380.1783 1387.7446 1393.1016 1407.4386 1447.7384 1461.3514 1463.5791 1465.4884 1473.5192 1474.1377 1483.1182 1487.7404 1498.1551 1582.0480 1585.9718 1587.6726 1600.5262 2974.1063 2976.6365 2980.8847 3070.8291 3072.1681 3073.0058 3079.9358 3081.2496 3083.3880 3118.2669 3133.1603 3142.5194 3145.1426 3147.2256 3163.2097 3166.8271 3174.1094 3177.9179 3392.0508
redmass: 4.4711 3.5517 3.7970 4.1754 3.9441 6.7001 5.7183 4.7705 3.6940 5.5724 2.0683 5.1201 2.5426 2.8680 1.1240 4.4205 3.1193 1.0507 3.5258 3.6548 4.4473 3.5041 2.8521 2.8829 4.1154 3.1256 3.0312 5.8228 3.4887 3.2472 3.3025 5.0064 6.1479 7.1208 1.8854 5.5838 3.2887 1.6335 2.2684 5.8254 3.0078 2.5946 1.3330 1.2731 1.5457 1.4697 1.7504 1.6508 1.2059 8.3060 1.3305 1.4084 1.4364 5.5221 5.1696 1.3315 1.4110 2.1440 1.3775 2.8101 1.5738 2.2533 1.3950 1.0570 1.1360 1.1305 2.9635 2.6704 1.6318 2.1067 3.0488 1.2790 1.2622 3.7200 1.5291 1.1827 6.8615 2.7750 1.2019 2.2440 1.0572 1.3736 1.0484 1.4497 1.9206 1.1328 1.0502 1.0787 5.9344 7.3251 5.8983 5.9158 1.0353 1.0347 1.0359 1.1007 1.0999 1.1003 1.0995 1.0989 1.0993 1.0874 1.0872 1.0882 1.0934 1.0893 1.0979 1.0957 1.0944 1.0978 1.0756
irintensity: 0.0734 0.2384 0.1618 0.2941 0.7790 4.2498 1.1633 1.5288 3.3947 3.3781 2.3179 0.2037 2.6402 0.2998 0.3927 6.4566 1.8233 0.0343 2.9448 14.0306 1.5135 8.4004 3.1076 0.4539 22.2218 13.3550 13.2190 132.3590 8.4096 17.0159 41.6629 13.1637 1.9905 0.0941 38.4302 1.9817 1.5104 94.8505 11.4891 99.4601 59.5699 15.7014 21.7699 1.3226 25.6009 6.5785 3.0863 2.2118 0.0775 52.2811 0.8716 0.4975 0.6869 0.1998 6.3467 0.5177 1.8277 4.6599 0.1280 40.6921 12.4879 21.4771 6.1917 0.0491 2.3347 4.0839 4.9173 1.5467 0.3508 11.3716 26.4894 1.3006 2.3678 1.3334 14.5480 18.0749 0.6505 27.2749 9.6798 10.6771 0.1854 8.7154 0.4013 20.5874 17.4539 13.3533 13.0997 31.9983 2.3356 1.9107 11.3860 5.0635 27.2369 29.2579 24.7614 10.6438 2.9766 9.4717 50.4983 91.5998 48.0929 6.7199 0.6502 8.6413 26.3123 1.7377 23.4087 3.6559 9.3430 6.2392 16.5692
temp: 298.150 k
press: 1.00000 atm
elementType: 16 8 8 7 6 6 6 6 6 6 6 6 6 6 6 6 6 6 6 6 1 1 1 1 1 1 1 1 1 1 1 1 1 1 1 1 1 1 1
symmnumber: 1
zpe: 815951.4 jmol-1
zpe.correction: 0.310779 hartree
zpe.thermalcorrener: 0.331170 hartree
zpe.thermalcorrenthalpy: 0.332114 hartree
zpe.thermalcorrgfe: 0.260212 hartree
zpe.sumelectzpe: -1222.717398 hartree
zpe.sumelectthermal: -1222.697008 hartree
zpe.sumelectthermalent: -1222.696064 hartree
zpe.sumelectthermalfe: -1222.767966 hartree
dipole: -5.2642 5.8544 -1.9230
dipole: 8.1046
quadrupole: -125.3253 -137.4762 -121.4791
quadrupole: 12.2849 -0.2691 5.6721
quadrupole: 2.7682 -9.3826 6.6144 12.2849 -0.2691 5.6721
hfenergy: -1223.0281779 hartree
pointgroup: C01 [X(C16H19N1O2S1)]
dipole: -1.9968953 -2.3670844 0.7591881 debye
polarizability: 242.6206367|-7.5465298|237.3119517|-17.7260754|12.8637206|177.9667118 unknown
InChI: InChI=1S/C16H19NO2S/c1-16(2,3)13-9-11-15(12-10-13)20(18,19)17-14-7-5-4-6-8-14/h4-12,17H,1-3H3
charge 0 multiplicity 1
39 atoms
S  1.576552 2.161545 -0.184142
O  1.491596 3.531754 0.685269
O  2.09525 2.108977 -1.720381
N  2.826345 1.068902 0.829098
C  -4.009698 -0.633703 0.000223
C  -2.636622 0.078043 -0.023976
C  -3.786325 -2.168866 0.158437
C  -4.755234 -0.3561 -1.340862
C  -4.908708 -0.150013 1.166551
C  -1.692166 -0.255813 -1.036171
C  -2.272771 1.069205 0.926052
C  -0.117242 1.324197 -0.127917
C  -0.426777 0.360848 -1.103349
C  -1.008409 1.700193 0.88767
C  2.90478 -0.306827 0.479795
C  3.433287 -0.663389 -0.793867
C  2.518919 -1.32911 1.393691
C  3.569397 -2.02337 -1.136828
C  2.697584 -2.686328 1.053024
C  3.212488 -3.040007 -0.216534
H  -4.759728 -2.693653 0.156033
H  -3.177441 -2.583073 -0.664758
H  -3.271953 -2.397722 1.109614
H  -4.185006 -0.723074 -2.212709
H  -5.735913 -0.866958 -1.339274
H  -4.928724 0.72639 -1.480366
H  -5.870519 -0.693198 1.138426
H  -4.44587 -0.344672 2.151798
H  -5.135062 0.929693 1.092056
H  -1.944384 -1.008546 -1.790495
H  -2.977216 1.364347 1.707897
H  0.28809 0.120922 -1.896345
H  -0.735633 2.483014 1.603413
H  2.566961 1.256485 1.81456
H  3.737036 0.130527 -1.482371
H  2.097424 -1.055838 2.369666
H  3.97645 -2.292255 -2.117827
H  2.422037 -3.46658 1.771188
H  3.339904 -4.094546 -0.483785
