program: Gaussian 09
title: 000260330
version: EM64L-G09RevD.01
frameworkgroup: C1[X(C15H11Br2NO)]
method: RPBEPBE
basis: SDD
operation: Freq
keyword: #p
keyword: freq=noraman
keyword: PBEPBE/SDD
title: #p freq=noraman PBEPBE/SDD
converged: NO YES NO NO
title: Mulliken charges:
elementType: Br Br O N C C C C C C C C C C C C C C C H H H H H H H H H H H
charge: 0.006146 0.004368 -0.256800 -0.449344 -0.692112 0.334586 0.200557 0.267748 0.200027 -0.571038 -0.384043 -0.367026 -0.381256 0.701110 -0.546251 -0.218757 -0.189751 0.215802 -0.796254 0.255556 0.255555 0.329207 0.259905 0.263491 0.245488 0.250221 0.310926 0.241692 0.268574 0.241675
chargesum: 0.00000
title: Mulliken charges with hydrogens summed into heavy atoms:
elementType: Br Br O N C C C C C C C C C C C C C C C
charge: 0.006146 0.004368 -0.256800 -0.138418 -0.181002 0.334586 0.200557 0.267748 0.200027 -0.241831 -0.124138 -0.103536 -0.135768 0.701110 -0.546251 -0.218757 0.060470 0.215802 -0.044314
polarizability: 4.05679686e+02 7.60519493e+00 2.11998585e+02 -4.83525585e-03 -2.61835651e-03 8.06962231e+01
1716.lowfreq: -73.0732 -3.8161 -0.0009 0.0000 0.0008 3.8981 4.5678 31.2320 54.8363
frequency: -73.0727 31.2319 54.8325 64.1169 73.9732 98.3868 111.3093 145.7352 165.3190 189.4760 190.8507 250.9205 252.2444 276.7952 278.0254 323.9942 386.8820 396.1151 432.0163 439.0596 470.4806 523.5324 526.5021 564.8243 577.9294 598.5109 632.8966 653.2530 666.6631 690.6829 724.2662 747.4714 752.9723 768.9126 826.3292 842.7857 870.6927 880.3853 922.7544 923.7392 945.9635 956.0029 977.8434 997.7832 1003.7371 1032.6657 1056.3130 1116.6206 1136.1427 1146.5504 1176.2384 1203.5647 1205.4380 1232.7838 1244.3527 1275.9288 1311.2147 1352.8878 1369.0761 1376.5218 1411.5247 1423.4836 1429.3110 1439.1512 1450.8848 1466.5812 1481.6836 1502.1780 1575.5700 1579.1837 1610.8922 1620.8231 1633.0502 2988.5209 2990.0251 3035.1299 3073.7312 3138.3948 3139.2607 3155.3401 3161.6550 3173.7862 3175.7805 3471.1184
redmass: 1.0398 7.1666 5.0531 5.6640 9.7260 5.1612 8.5500 5.4370 13.0597 11.0353 3.5032 7.4364 3.1714 6.6329 3.7915 5.6015 5.0252 6.2051 3.2469 2.9811 4.7954 3.3767 4.5487 5.0602 3.1699 6.0669 3.5744 6.7546 7.0113 1.3701 3.2309 5.7475 2.9264 5.1359 1.4506 5.1922 1.4576 1.5211 1.5271 4.4540 3.2120 1.3730 1.8138 7.1823 1.8239 1.6624 2.0659 2.1795 1.1476 1.9119 1.8839 1.8944 2.7142 2.3563 1.4092 1.4169 3.3423 4.5097 5.5959 1.2481 3.8756 1.2102 5.2410 1.9390 1.3766 1.0463 3.9472 2.1003 7.8912 6.1424 7.6534 7.7955 4.8353 1.0383 1.0611 1.0993 1.0983 1.0982 1.0898 1.0931 1.0927 1.0955 1.0932 1.0764
irintensity: 0.2098 0.0030 0.2586 10.8850 0.6500 0.2846 3.1370 0.1794 2.0218 0.0502 3.0993 5.9681 3.4307 2.1539 1.9709 14.8947 0.9469 0.6790 18.5382 3.9471 1.5569 6.1671 2.0977 5.4221 0.0000 11.5405 0.3953 0.7803 14.9866 60.4395 12.7899 25.5550 1.6556 2.6600 52.7970 58.0566 20.3734 2.7194 1.6350 3.9550 36.5746 0.7735 33.2222 17.6667 19.7388 8.2737 25.3045 16.6232 0.1076 5.2228 36.7744 2.0986 12.4792 103.4593 51.4137 13.8516 44.0952 145.7052 3.4254 62.6185 69.7169 5.7265 69.3949 91.7490 91.9139 20.0232 17.0446 522.4336 33.2767 76.9888 16.0948 48.3556 88.1888 6.6733 8.0813 4.5407 13.1611 7.5067 7.5706 2.7230 1.2195 6.5961 11.6205 55.7677
temp: 298.150 k
press: 1.00000 atm
elementType: 35 35 8 7 6 6 6 6 6 6 6 6 6 6 6 6 6 6 6 1 1 1 1 1 1 1 1 1 1 1
symmnumber: 1
zpe: 571644.9 jmol-1
zpe.correction: 0.217728 hartree
zpe.thermalcorrener: 0.234119 hartree
zpe.thermalcorrenthalpy: 0.235063 hartree
zpe.thermalcorrgfe: 0.171222 hartree
zpe.sumelectzpe: -733.814631 hartree
zpe.sumelectthermal: -733.798239 hartree
zpe.sumelectthermalent: -733.797295 hartree
zpe.sumelectthermalfe: -733.861137 hartree
dipole: 2.8392 -1.4021 0.0003
dipole: 3.1665
quadrupole: -120.0270 -129.7066 -133.1939
quadrupole: -4.4903 0.0017 0.0008
quadrupole: 7.6155 -2.0641 -5.5514 -4.4903 0.0017 0.0008
hfenergy: -734.0323587 hartree
pointgroup: C01 [X(C15H11Br2N1O1)]
dipole: 1.0128357 0.7254086 -0.0010699 debye
polarizability: 403.0231526|23.7760736|214.6548809|-0.0229799|-0.178524|80.6964611 unknown
InChI: InChI=1S/C15H11Br2NO/c1-8(19)18-15-6-10-4-9-5-11(16)2-3-12(9)13(10)7-14(15)17/h2-3,5-7,18H,4H2,1H3
charge 0 multiplicity 1
30 atoms
Br 2.919779 3.152227 -0.004088
Br -6.499734 -0.851783 0.001087
O  4.077525 -2.199644 0.003084
N  3.767214 0.13231 -0.000154
C  -1.002989 -1.739065 0.002314
C  0.104287 -0.691762 0.000919
C  -0.465741 0.61591 -0.000808
C  -2.270143 -0.891005 0.001182
C  -1.93251 0.497727 -0.000654
C  1.490865 -0.885773 0.001177
C  0.372795 1.751483 -0.002303
C  -3.612911 -1.305778 0.001716
C  -2.947153 1.479649 -0.001955
C  2.357283 0.24835 -0.00031
C  1.762618 1.548196 -0.002025
C  -4.611145 -0.304803 0.000378
C  -4.301602 1.074003 -0.001437
C  4.553424 -1.027248 0.001501
C  6.054524 -0.741453 0.000991
H  -0.946293 -2.397874 0.890449
H  -0.946298 -2.400254 -0.884049
H  1.946016 -1.878427 0.002502
H  -0.034082 2.766468 -0.003643
H  -3.8856 -2.365374 0.003123
H  -2.705815 2.548078 -0.003365
H  -5.104139 1.816794 -0.002428
H  4.272888 1.024769 -0.001406
H  6.350717 -0.165009 -0.894955
H  6.594426 -1.698766 0.00249
H  6.350794 -0.162148 0.895063
