program: Gaussian 09
title: 000260319
version: EM64L-G09RevD.01
frameworkgroup: C1[X(C11H15N3O6)]
method: RPBEPBE
basis: SDD
operation: Freq
keyword: #p
keyword: freq=noraman
keyword: PBEPBE/SDD
title: #p freq=noraman PBEPBE/SDD
converged: YES YES NO NO
title: Mulliken charges:
elementType: O O O O O O N N N C C C C C C C C C C C H H H H H H H H H H H H H H H
charge: -0.258518 -0.482916 -0.265515 -0.267218 -0.247139 -0.324210 -0.174472 -0.406953 -0.605073 -0.130370 -0.065466 -0.521877 0.015056 -0.382496 -0.242156 0.229406 0.206423 0.093598 -0.772462 0.327655 0.235219 0.285096 0.256448 0.271936 0.246010 0.265386 0.225564 0.381199 0.342760 0.358417 0.242596 0.220257 0.245002 0.349288 0.349523
chargesum: 0.00000
title: Mulliken charges with hydrogens summed into heavy atoms:
elementType: O O O O O O N N N C C C C C C C C C C C
charge: -0.258518 -0.101718 -0.265515 -0.267218 -0.247139 -0.324210 -0.174472 -0.048536 0.093738 0.104849 0.219631 0.006508 0.261066 0.108454 0.100605 0.229406 0.206423 0.093598 -0.064607 0.327655
polarizability: 1.81700075e+02 -5.63513636e+00 1.74960535e+02 7.98714691e+00 2.13853196e+00 1.19722618e+02
1716.lowfreq: -10.9517 -3.8282 -0.0008 -0.0005 -0.0003 7.0749 21.9392 40.0335 56.6328
frequency: 21.8381 39.9713 56.6021 67.7799 90.5105 94.8344 115.7914 128.0147 144.4474 171.1790 182.8168 195.3096 239.9340 266.0567 277.0865 297.9847 314.2695 328.2691 379.2959 394.5315 413.4257 449.9143 467.8652 481.9627 500.9483 526.1466 546.5369 553.8867 611.6159 612.2103 649.8218 672.1616 688.6652 706.8902 714.0994 719.7247 737.2614 761.9796 781.5192 794.1148 808.7705 841.3782 871.8080 935.3505 950.6941 968.3566 975.4147 1002.4717 1014.8160 1029.5341 1055.5489 1058.9981 1063.8447 1075.1934 1093.7999 1114.2537 1139.8939 1180.4362 1206.4754 1229.5815 1235.6413 1256.9237 1271.9648 1281.0740 1297.3444 1306.9105 1323.1254 1345.8958 1349.7309 1372.7589 1380.9490 1385.1096 1405.9423 1409.3323 1427.4028 1450.5163 1452.4616 1466.2569 1476.0122 1587.6316 1617.5902 1638.6760 1666.4352 1669.5553 2973.4110 2986.2103 2995.1312 3023.3498 3047.0782 3065.9740 3094.6152 3096.7996 3109.0532 3117.1824 3124.6803 3399.4038 3524.5359 3553.5952 3709.2677
redmass: 6.4366 5.7660 5.6620 6.5858 5.9533 6.0642 1.3361 2.5837 5.2036 7.0976 5.3658 5.5310 3.8233 4.9565 3.5685 4.4358 4.4934 3.1066 8.8768 3.0403 3.6754 4.7180 4.4897 4.7068 3.7198 1.1051 1.1652 6.3029 5.7406 5.0519 4.9924 4.5478 1.2793 2.5850 3.7081 5.4762 7.0360 5.4915 2.2294 3.6659 3.1851 2.9860 3.7133 2.6962 4.9849 1.3943 2.6816 1.9348 5.2300 2.6907 2.7180 1.5272 2.1468 2.6992 3.3173 2.1286 4.2812 1.4814 1.2694 3.6243 1.3048 2.2225 1.2138 1.2437 1.3901 1.3986 1.6599 1.7657 1.8845 2.0031 1.6323 1.4653 1.2622 1.4929 1.9579 1.1141 1.0441 1.0885 1.0857 1.2810 5.7035 8.3713 5.6674 5.4410 1.0837 1.0363 1.0864 1.0640 1.0630 1.0974 1.0996 1.0999 1.0980 1.0935 1.1018 1.0652 1.0768 1.0450 1.1060
irintensity: 1.7368 0.9768 0.8829 8.8501 3.0224 2.3764 0.0855 0.4443 5.2875 3.7782 6.5326 4.6953 16.1640 3.7102 4.5523 15.7866 8.7048 3.4797 13.7409 6.4612 4.6783 11.2952 17.8309 8.7486 8.5681 67.2644 207.3071 61.1799 1.7423 1.2777 2.8605 9.8957 139.1931 5.9361 116.1174 4.7829 11.4372 13.3692 105.5564 5.4278 12.0729 8.1323 48.5350 62.9959 93.3155 16.4032 18.7348 12.1577 128.4653 72.1477 29.2944 18.6842 12.3066 3.1607 41.2850 14.0006 7.6752 27.9720 48.7966 14.0054 26.7217 258.6180 15.6410 12.6243 10.3140 32.6839 127.8614 40.1059 101.6807 75.7226 91.5649 38.2670 15.5695 11.2581 70.5821 29.6690 12.1379 19.5380 5.2919 64.5940 208.4128 301.0441 511.4516 486.9704 20.6563 22.0593 48.5465 38.6919 16.9144 14.7747 76.4927 0.8893 3.8693 16.7718 5.0796 258.8400 54.9365 93.3450 60.1667
temp: 298.150 k
press: 1.00000 atm
elementType: 8 8 8 8 8 8 7 7 7 6 6 6 6 6 6 6 6 6 6 6 1 1 1 1 1 1 1 1 1 1 1 1 1 1 1
symmnumber: 1
zpe: 710040.0 jmol-1
zpe.correction: 0.270440 hartree
zpe.thermalcorrener: 0.289330 hartree
zpe.thermalcorrenthalpy: 0.290274 hartree
zpe.thermalcorrgfe: 0.222315 hartree
zpe.sumelectzpe: -1042.298686 hartree
zpe.sumelectthermal: -1042.279796 hartree
zpe.sumelectthermalent: -1042.278851 hartree
zpe.sumelectthermalfe: -1042.346811 hartree
dipole: 8.0660 1.1055 0.3364
dipole: 8.1483
quadrupole: -113.6722 -117.2120 -118.1589
quadrupole: 12.3889 -16.3581 -9.3813
quadrupole: 2.6755 -0.8643 -1.8112 12.3889 -16.3581 -9.3813
hfenergy: -1042.5691259 hartree
pointgroup: C01 [X(C11H15N3O6)]
dipole: -3.1417736 0.3933999 -0.5016152 debye
polarizability: 182.2401948|9.1818144|150.9599271|3.2230595|-27.0986978|143.1831062 unknown
InChI: InChI=1S/C11H15N3O6/c1-5-3-14(11(18)13-9(5)16)8-2-6(15)7(20-8)4-19-10(12)17/h3,6-8,13,15H,2,4,12H2,1H3
charge 0 multiplicity 1
35 atoms
O  -0.609308 -0.946765 1.522437
O  -1.370968 -0.752088 -1.953313
O  -3.59551 1.018025 1.00295
O  2.773924 -1.426117 2.307967
O  4.590466 1.916172 -0.400352
O  -3.70598 0.558606 -1.308088
N  1.558309 -0.770413 0.386631
N  3.629781 0.242538 0.912057
N  -4.672002 2.470544 -0.36702
C  -1.537472 -1.443793 -0.676041
C  0.446568 -1.671127 0.782826
C  -0.295306 -2.330373 -0.401703
C  -1.583136 -0.436894 0.524041
C  -2.928702 -0.288569 1.255058
C  1.491318 0.039485 -0.758264
C  2.662785 -0.701147 1.281522
C  2.46119 0.954424 -1.096641
C  3.630709 1.110499 -0.219866
C  2.386018 1.811906 -2.336081
C  -3.974659 1.291995 -0.313287
H  -2.460724 -2.054119 -0.702714
H  0.879516 -2.372312 1.50974
H  -0.605108 -3.339727 -0.087108
H  0.321638 -2.429973 -1.308254
H  -1.249074 0.55808 0.161322
H  -2.757028 -0.276403 2.341587
H  -3.632216 -1.09826 0.989372
H  -2.198085 -0.20189 -2.072655
H  0.608029 -0.108021 -1.392463
H  4.437543 0.311941 1.539437
H  2.409346 2.884882 -2.07187
H  1.467542 1.604842 -2.911174
H  3.26059 1.634639 -2.988116
H  -4.858178 2.99757 0.483438
H  -4.991713 2.810747 -1.269976
