program: Gaussian 09
title: 000260278
version: EM64L-G09RevD.01
frameworkgroup: C1[X(C20H25ClN2O3)]
method: RPBEPBE
basis: SDD
operation: Freq
keyword: #p
keyword: freq=noraman
keyword: PBEPBE/SDD
title: #p freq=noraman PBEPBE/SDD
converged: YES YES NO NO
title: Mulliken charges:
elementType: Cl O O O N N C C C C C C C C C C C C C C C C C C C C H H H H H H H H H H H H H H H H H H H H H H H H H
charge: -0.065295 -0.456647 -0.305888 -0.268807 -0.105544 -0.167692 -0.364525 -0.361859 -0.419837 -0.404116 -0.371622 -0.121152 0.534741 -0.305920 -0.298717 -0.341537 -0.221019 -0.241110 -0.247031 0.365018 -0.344000 -0.364700 -0.350479 -0.326014 0.314513 -0.536989 0.207475 0.198932 0.203995 0.209432 0.200407 0.229305 0.233203 0.209929 0.213532 0.223693 0.210679 0.210747 0.236209 0.247833 0.359601 0.251816 0.226781 0.233594 0.247133 0.249198 0.238522 0.252366 0.244593 0.218901 0.218355
chargesum: 0.00000
title: Mulliken charges with hydrogens summed into heavy atoms:
elementType: Cl O O O N N C C C C C C C C C C C C C C C C C C C C
charge: -0.065295 -0.097046 -0.305888 -0.268807 -0.105544 -0.167692 0.041881 0.051568 0.009875 0.039015 0.065603 0.089528 0.534741 0.141037 -0.298717 -0.093704 0.030796 -0.014328 -0.013437 0.365018 -0.096867 -0.115502 -0.111958 -0.073648 0.314513 0.144859
polarizability: 3.29608788e+02 4.27938235e+00 2.35669022e+02 -1.02613580e+01 7.73111849e+00 2.01604274e+02
1716.lowfreq: -5.1594 0.0013 0.0019 0.0021 2.6471 5.5456 7.6048 12.9655 22.9375
frequency: 7.1622 10.7597 22.9293 31.8020 46.6032 59.9510 77.1395 80.0704 91.8633 109.2593 130.6204 152.1667 166.4658 171.9585 193.8875 216.6652 229.8366 242.1813 247.1540 266.9496 278.1139 306.7199 328.0520 347.3345 361.8068 363.2654 396.9204 404.1335 416.7619 440.1298 446.8301 453.6714 472.1591 476.6429 490.5042 505.1316 514.3006 546.4386 549.1877 560.9006 622.6845 630.4943 656.2028 710.8788 711.3698 720.9797 730.7912 751.4217 777.4058 790.4337 810.8483 826.5989 839.7030 847.8253 858.0513 900.2796 910.4599 925.3861 928.3797 951.0918 952.4675 969.6386 979.7014 989.7304 998.4637 1000.8192 1009.5708 1038.9363 1044.3918 1049.9978 1065.2023 1073.6412 1086.8390 1109.5858 1111.0038 1112.4413 1120.4982 1142.2888 1144.5903 1154.7883 1163.0979 1172.2079 1175.0588 1198.7213 1199.0663 1206.1393 1232.0261 1236.5861 1237.3778 1252.3576 1267.9326 1282.6072 1295.4180 1297.3827 1314.6569 1326.4192 1339.7476 1348.6424 1359.2486 1362.5265 1369.5155 1377.1321 1380.6478 1391.2348 1402.8572 1425.2402 1427.6459 1435.5775 1452.1053 1454.1824 1458.5825 1462.6047 1464.3353 1465.7615 1473.9901 1476.1618 1480.8954 1496.3124 1558.9881 1590.2505 1606.0937 1625.7492 2870.0255 2884.1305 2900.0318 2906.8980 2917.7549 2953.8766 2958.3660 2968.2794 3032.5086 3038.0567 3038.8706 3040.2552 3048.5197 3056.0469 3102.8693 3122.2771 3132.1003 3148.8929 3149.1279 3153.0229 3158.4398 3169.3036 3173.6263 3175.4776 3542.7043
redmass: 5.4271 5.8549 3.8175 5.7245 5.6841 5.0539 3.8935 5.0793 3.7051 3.6833 4.1440 4.5855 4.4029 4.5617 3.8833 5.0326 6.1173 1.2368 2.9826 3.0099 2.4740 3.2591 2.7050 4.1959 5.4567 3.8926 2.6307 3.6890 3.0460 1.2354 3.3655 2.4949 3.3038 3.8131 3.8504 3.2280 2.3549 4.1403 4.1397 4.6609 2.7795 6.7001 4.0679 3.6057 3.7094 5.6008 4.1926 1.3256 3.4923 1.3268 5.9416 1.5845 1.4642 1.5065 2.4029 1.5677 1.6692 3.8103 1.3875 2.0422 1.3667 1.3222 6.1097 6.2495 2.6805 2.9173 5.6377 2.3311 1.9764 1.8395 2.0119 2.1007 2.2341 1.4542 1.9418 1.2628 1.8308 2.4463 2.5670 1.3383 1.6818 1.1150 1.2328 1.2492 2.4587 1.4601 1.3720 4.6446 1.4237 1.2642 1.5190 1.3408 1.3962 1.2969 1.2890 1.2983 1.3226 1.6008 1.5883 1.7925 2.2180 1.7955 3.4116 1.5719 1.7331 3.7306 2.4405 1.1726 1.0825 1.0971 1.1455 1.1211 1.1043 1.0502 1.0815 1.0950 2.6134 2.2212 5.9093 7.7784 6.8516 6.4180 1.0705 1.0692 1.0687 1.0689 1.0708 1.0334 1.0775 1.0626 1.0914 1.0917 1.1037 1.0908 1.1041 1.0908 1.0893 1.0989 1.0855 1.0870 1.0892 1.0880 1.0945 1.0954 1.1005 1.0973 1.0653
irintensity: 0.0537 0.3981 1.9464 0.0744 0.8290 0.6369 1.0348 0.1071 4.5249 0.6235 1.3582 2.9652 1.5745 8.9061 0.7319 2.7275 1.3301 1.2021 3.7097 8.6235 8.8841 4.8332 4.3592 8.2131 1.8262 2.0144 1.3495 9.2119 0.1402 139.2620 8.1614 34.5894 1.0156 4.1614 3.0540 15.8951 20.2513 3.9103 2.8623 3.6955 0.5064 0.3713 19.4167 0.0982 3.7515 49.9454 10.4942 86.3380 20.1850 20.0310 4.2178 73.5432 0.3967 2.4268 7.1799 7.5324 10.4853 33.6614 1.3195 7.8307 1.1012 0.4861 109.6813 28.1495 83.7628 37.7787 77.0992 17.6911 40.5024 16.8235 2.2592 5.0266 4.2298 27.8285 12.7605 0.4251 8.1274 32.2879 47.8582 0.7664 15.9903 3.1882 12.9684 37.5512 436.6973 8.8694 41.7697 5.7179 69.2562 23.7852 6.8881 28.2329 31.9524 6.5428 20.3502 11.3434 1.0507 2.3854 3.3185 8.6664 9.1228 51.9296 3.3152 6.6498 10.5728 3.6977 11.9857 28.1551 9.9882 11.7567 75.4059 90.8945 4.2824 13.2411 57.1775 13.4030 120.4264 250.6363 2.4474 8.4002 84.4212 3.7558 55.3904 38.8641 64.6884 81.7023 138.2159 66.3445 28.1403 36.2673 9.3922 47.9474 53.3936 49.6152 50.8129 25.6455 6.1999 28.4658 5.8125 18.9918 8.3182 4.1793 16.9381 13.6701 15.1263 2.3026 13.7826
temp: 298.150 k
press: 1.00000 atm
elementType: 17 8 8 8 7 7 6 6 6 6 6 6 6 6 6 6 6 6 6 6 6 6 6 6 6 6 1 1 1 1 1 1 1 1 1 1 1 1 1 1 1 1 1 1 1 1 1 1 1 1 1
symmnumber: 1
zpe: 1091322.4 jmol-1
zpe.correction: 0.415663 hartree
zpe.thermalcorrener: 0.440829 hartree
zpe.thermalcorrenthalpy: 0.441773 hartree
zpe.thermalcorrgfe: 0.356202 hartree
zpe.sumelectzpe: -1570.352849 hartree
zpe.sumelectthermal: -1570.327683 hartree
zpe.sumelectthermalent: -1570.326739 hartree
zpe.sumelectthermalfe: -1570.412310 hartree
dipole: 0.2951 -3.4557 0.4981
dipole: 3.5039
quadrupole: -167.9413 -162.7291 -153.2250
quadrupole: -2.9175 13.0702 -4.7808
quadrupole: -6.6429 -1.4306 8.0735 -2.9175 13.0702 -4.7808
hfenergy: -1570.7685122 hartree
pointgroup: C01 [X(C20H25Cl1N2O3)]
dipole: 0.0428565 1.3333233 -0.3475078 debye
polarizability: 329.4608787|2.1869408|236.91748|11.606092|4.3478069|200.5037242 unknown
InChI: InChI=1S/C20H25ClN2O3/c1-25-17-6-8-18(9-7-17)26-15-16(24)14-22-10-12-23(13-11-22)20-5-3-2-4-19(20)21/h2-9,16,24H,10-15H2,1H3
charge 0 multiplicity 1
51 atoms
Cl -5.935721 -1.245845 -1.801842
O  2.007452 -3.678026 0.567709
O  3.268745 -1.16396 0.733697
O  7.414878 2.42183 -0.57972
N  -1.001993 -1.573331 -0.161207
N  -3.554499 -0.216797 -0.011941
C  -1.740828 -1.446344 1.121343
C  -1.96137 -1.616274 -1.296943
C  -2.618009 -0.180674 1.129527
C  -2.833112 -0.352122 -1.304238
C  -0.063267 -2.722564 -0.17011
C  1.245315 -2.421543 0.580955
C  -4.743179 0.548957 0.052601
C  2.047838 -1.300603 -0.084111
C  -5.902074 0.240659 -0.723798
C  -4.872066 1.655276 0.94903
C  -7.08717 0.992489 -0.654437
C  -6.063597 2.401466 1.048879
C  -7.17604 2.08592 0.237889
C  4.242556 -0.233841 0.315091
C  4.122745 0.592289 -0.823837
C  5.403636 -0.156734 1.12644
C  5.163885 1.494614 -1.156565
C  6.434261 0.736415 0.797916
C  6.320757 1.567609 -0.347557
C  7.346588 3.291559 -1.753559
H  -1.018485 -1.383188 1.955026
H  -2.394841 -2.336659 1.299078
H  -2.629014 -2.511092 -1.243171
H  -1.387717 -1.668354 -2.240772
H  -1.95453 0.715781 1.091929
H  -3.194392 -0.150801 2.070736
H  -3.554984 -0.404212 -2.132378
H  -2.17928 0.536732 -1.461737
H  0.191888 -2.964809 -1.21886
H  -0.507187 -3.644275 0.275304
H  1.038448 -2.121736 1.630757
H  2.322671 -1.587192 -1.120329
H  1.469092 -0.357472 -0.091679
H  -4.00965 1.941809 1.559059
H  2.915478 -3.471065 0.911339
H  -7.942774 0.70352 -1.272376
H  -6.114775 3.241999 1.749732
H  -8.1026 2.664853 0.300878
H  3.233631 0.551649 -1.459577
H  5.47778 -0.801558 2.007453
H  5.052033 2.125316 -2.043706
H  7.336959 0.809331 1.411715
H  8.288188 3.860179 -1.747377
H  7.273522 2.702754 -2.68947
H  6.489307 3.990865 -1.689887
