program: Gaussian 09
title: 000260279
version: EM64L-G09RevD.01
frameworkgroup: C1[X(C20H25ClN2O3)]
method: RPBEPBE
basis: SDD
operation: Freq
keyword: #p
keyword: freq=noraman
keyword: PBEPBE/SDD
title: #p freq=noraman PBEPBE/SDD
converged: YES YES NO NO
title: Mulliken charges:
elementType: Cl O O O N N C C C C C C C C C C C C C C C C C C C C H H H H H H H H H H H H H H H H H H H H H H H H H
charge: -0.084001 -0.456738 -0.306597 -0.268726 -0.105351 -0.178162 -0.357569 -0.374599 -0.385188 -0.401080 -0.376450 -0.116219 0.497197 -0.305850 -0.308825 -0.394106 -0.102989 -0.206828 -0.295012 0.365872 -0.342698 -0.364637 -0.351105 -0.325838 0.315051 -0.536822 0.210415 0.196178 0.192750 0.215470 0.218545 0.208421 0.221126 0.210891 0.214938 0.225533 0.208418 0.211224 0.235418 0.262169 0.222519 0.360676 0.226159 0.256018 0.246707 0.249009 0.239115 0.252778 0.244988 0.218724 0.219084
chargesum: 0.00000
title: Mulliken charges with hydrogens summed into heavy atoms:
elementType: Cl O O O N N C C C C C C C C C C C C C C C C C C C C
charge: -0.084001 -0.096063 -0.306597 -0.268726 -0.105351 -0.178162 0.049024 0.033621 0.041777 0.030937 0.064022 0.092198 0.497197 0.140792 -0.046656 -0.171587 -0.102989 0.019331 -0.038994 0.365872 -0.095990 -0.115629 -0.111990 -0.073059 0.315051 0.145974
polarizability: 3.21774418e+02 -1.61625009e+01 2.53979430e+02 1.06045760e+00 -2.82425384e+01 1.98128613e+02
1716.lowfreq: -6.5676 -4.0787 0.0006 0.0014 0.0016 5.0863 7.7073 10.1832 25.6830
frequency: 7.4027 9.9535 25.6222 31.9635 43.3509 45.3244 68.9399 80.2960 92.8437 109.2021 129.2562 141.3702 168.9689 179.1755 189.4412 197.0113 231.0790 232.9977 243.9121 260.0363 271.6099 289.1947 318.9638 352.9979 362.3226 367.2352 390.4478 399.5713 417.0682 438.7536 439.5818 452.1966 461.9289 475.2524 482.9645 504.1989 514.4710 544.9888 553.3940 569.8098 627.7431 630.4118 663.4697 678.7403 711.1016 720.8833 753.1567 762.8916 784.6364 790.6875 810.9542 826.5137 834.4616 848.8265 856.5842 860.9300 900.8660 911.9531 936.5275 952.1391 953.2075 959.9298 969.9148 980.3927 989.1444 998.2771 1002.2015 1039.1007 1049.3944 1064.4834 1071.9846 1078.6732 1086.1075 1097.3862 1109.3886 1110.6657 1112.8295 1142.5820 1146.0434 1154.8417 1167.4849 1175.5233 1182.0068 1197.8948 1200.4785 1208.8111 1236.2821 1237.7607 1242.5537 1255.7689 1281.5322 1296.7310 1297.5848 1301.9276 1313.0987 1324.9556 1343.4437 1347.2551 1355.6882 1364.6152 1372.1146 1379.9578 1384.5001 1392.0110 1402.6446 1424.7262 1434.5139 1435.5549 1455.4214 1456.0064 1461.5870 1461.7411 1465.8757 1467.2175 1474.3684 1476.8069 1485.4340 1496.0899 1559.6535 1590.0671 1615.9172 1625.6878 2863.7089 2870.1553 2908.8907 2912.1797 2926.5529 2953.7821 2956.6045 2967.6889 3034.4920 3039.1885 3039.5220 3047.1757 3049.4938 3055.1311 3092.5503 3123.0422 3136.5125 3150.0524 3153.3108 3163.6277 3169.8533 3175.6992 3182.3367 3186.8301 3543.7105
redmass: 6.8209 4.9656 3.7050 5.0645 3.4324 5.3075 5.6965 4.8251 3.6728 4.2155 4.1860 4.8250 4.4355 5.1736 3.9485 3.7327 4.5291 2.3461 1.1981 3.1507 3.0612 3.3179 2.7122 3.6159 5.8065 6.1387 5.7033 2.2433 3.0190 1.4217 2.3917 2.3683 3.7182 3.6207 3.1586 3.1495 2.3478 5.0338 4.8264 4.3976 2.6260 6.4044 4.7336 2.0091 3.6046 5.6495 4.8083 1.5061 3.1982 1.3248 5.9722 1.5879 1.6259 1.5633 2.4207 1.4269 1.5299 1.6913 3.9493 1.3774 1.9485 1.3958 5.1683 6.3102 6.1795 2.7183 2.6420 2.1664 1.8189 1.9458 2.0117 2.2236 2.3173 1.7228 1.5951 1.7345 1.2605 2.2259 2.2778 1.3342 1.9957 1.2257 1.1079 2.7411 1.2493 1.4735 2.9958 1.8498 1.3613 1.2662 1.3643 1.2948 1.3494 1.3035 1.2878 1.2907 1.3407 1.6426 1.6652 1.5694 1.7138 4.2262 2.6140 1.5278 1.7352 3.7552 3.2445 1.1707 1.0827 1.1039 1.1172 1.1163 1.0505 1.1054 1.0874 1.0976 2.5036 2.2132 6.3610 7.7702 6.7537 6.4175 1.0712 1.0697 1.0689 1.0686 1.0708 1.0335 1.0791 1.0609 1.0916 1.1037 1.0916 1.0991 1.0943 1.0908 1.0891 1.0988 1.0870 1.0869 1.0880 1.0930 1.0956 1.0974 1.0959 1.0920 1.0653
irintensity: 0.7819 0.3935 2.4282 0.0236 0.6797 0.4520 0.8648 0.6331 4.3046 0.2958 0.7902 4.4516 8.4334 1.7323 0.5563 0.2364 6.8103 4.4099 0.8574 6.8679 0.1999 14.4823 0.8417 16.1567 0.8507 7.7530 0.5736 2.1209 0.0424 110.7390 21.7636 46.5423 2.4405 3.9757 3.5452 14.8688 19.7967 2.6665 0.1813 2.7644 3.1646 0.2507 6.5771 28.7081 0.1003 54.0794 23.0330 67.8066 18.8999 19.9172 4.0573 74.1282 17.3302 20.7431 6.0145 0.4133 8.5856 15.3894 95.7113 0.5485 10.5256 2.4633 25.4965 95.9168 27.7469 71.6414 56.8179 54.5686 18.1248 2.0729 6.2462 9.8754 5.7205 14.9295 31.6684 6.0522 0.1607 47.5273 41.1143 0.7108 24.2152 6.4731 1.7726 471.0091 2.9731 6.7186 24.2397 29.7490 122.6485 7.1025 25.2295 6.2694 15.8181 8.0626 22.3075 13.9965 2.7631 1.7322 12.0331 4.9628 26.8260 5.9681 31.5790 7.6924 10.1393 3.5098 3.7875 27.7224 8.4249 6.3057 84.2277 83.3473 13.0973 16.7300 65.8713 10.1738 132.8801 243.5627 88.1750 8.2917 273.1862 2.7830 45.5458 94.8416 64.0402 84.5421 104.7467 65.1894 30.4901 35.4295 2.9848 51.3837 44.6303 54.8510 48.6701 23.8258 20.2332 27.8998 12.8284 19.1424 3.9311 17.7384 13.2608 2.0655 5.8565 1.6481 15.0034
temp: 298.150 k
press: 1.00000 atm
elementType: 17 8 8 8 7 7 6 6 6 6 6 6 6 6 6 6 6 6 6 6 6 6 6 6 6 6 1 1 1 1 1 1 1 1 1 1 1 1 1 1 1 1 1 1 1 1 1 1 1 1 1
symmnumber: 1
zpe: 1091152.8 jmol-1
zpe.correction: 0.415598 hartree
zpe.thermalcorrener: 0.440945 hartree
zpe.thermalcorrenthalpy: 0.441889 hartree
zpe.thermalcorrgfe: 0.355506 hartree
zpe.sumelectzpe: -1570.357851 hartree
zpe.sumelectthermal: -1570.332504 hartree
zpe.sumelectthermalent: -1570.331560 hartree
zpe.sumelectthermalfe: -1570.417944 hartree
dipole: 1.3372 0.4446 0.0806
dipole: 1.4115
quadrupole: -186.5339 -162.8810 -155.2861
quadrupole: 23.3601 -12.4868 -9.4412
quadrupole: -18.3002 5.3527 12.9476 23.3601 -12.4868 -9.4412
hfenergy: -1570.7734494 hartree
pointgroup: C01 [X(C20H25Cl1N2O3)]
dipole: 0.5288563 0.1650465 -0.0379564 debye
polarizability: 321.1826477|-15.0689269|223.1074229|8.329764|-39.8651612|229.5923902 unknown
InChI: InChI=1S/C20H25ClN2O3/c1-25-19-5-7-20(8-6-19)26-15-18(24)14-22-9-11-23(12-10-22)17-4-2-3-16(21)13-17/h2-8,13,18,24H,9-12,14-15H2,1H3
charge 0 multiplicity 1
51 atoms
Cl -6.916685 2.371388 -2.513521
O  2.315191 -3.708784 0.787531
O  3.419626 -1.120829 0.746382
O  7.200057 2.720483 -0.903622
N  -0.839221 -1.833338 0.056179
N  -3.39074 -0.457001 0.16323
C  -1.544782 -1.642353 1.347762
C  -1.84181 -2.000897 -1.022384
C  -2.429348 -0.387468 1.290068
C  -2.747482 -0.760537 -1.130858
C  0.158909 -2.931376 0.092374
C  1.475617 -2.503645 0.764584
C  -4.560654 0.337451 0.19006
C  2.171935 -1.374406 0.00193
C  -5.090065 0.914866 -1.006076
C  -5.275042 0.563722 1.40883
C  -6.284542 1.651502 -0.950811
C  -6.462405 1.318035 1.421228
C  -7.000696 1.877645 0.236432
C  4.296427 -0.135559 0.245515
C  4.047723 0.645321 -0.904245
C  5.494618 0.048998 0.981834
C  4.995935 1.612786 -1.320958
C  6.433964 1.005723 0.569232
C  6.189699 1.794212 -0.585988
C  6.988908 3.565388 -2.079115
H  -0.804658 -1.516492 2.157729
H  -2.178787 -2.531246 1.594804
H  -2.484138 -2.900746 -0.847474
H  -1.315563 -2.139214 -1.98451
H  -1.774631 0.506502 1.177914
H  -2.97169 -0.290244 2.242679
H  -3.528536 -0.975341 -1.880594
H  -2.143476 0.103697 -1.49306
H  0.38954 -3.237112 -0.94538
H  -0.217162 -3.838851 0.621058
H  1.293236 -2.155058 1.803948
H  2.413333 -1.696795 -1.032095
H  1.5321 -0.471966 -0.022169
H  -4.571869 0.821339 -1.96207
H  -4.922708 0.124767 2.346384
H  3.223134 -3.426351 1.072627
H  -6.992721 1.46489 2.368683
H  -7.927213 2.456401 0.242001
H  3.129286 0.520676 -1.485274
H  5.669209 -0.563628 1.871589
H  4.785257 2.209184 -2.213469
H  7.363516 1.161755 1.124629
H  7.881957 4.204721 -2.139223
H  6.902085 2.95946 -3.002798
H  6.085559 4.197027 -1.965622
