program: Gaussian 09
title: 000260268
version: EM64L-G09RevD.01
frameworkgroup: C1[X(C20H25ClN2O2)]
method: RPBEPBE
basis: SDD
operation: Freq
keyword: #p
keyword: freq=noraman
keyword: PBEPBE/SDD
title: #p freq=noraman PBEPBE/SDD
converged: NO YES NO NO
title: Mulliken charges:
elementType: Cl O O N N C C C C C C C C C C C C C C C C C C C C H H H H H H H H H H H H H H H H H H H H H H H H H
charge: -0.084343 -0.446290 -0.321882 -0.101666 -0.177353 -0.371809 -0.363912 -0.402584 -0.378771 -0.376207 -0.137487 0.498433 -0.318418 -0.309822 -0.394694 -0.102885 -0.207019 -0.295782 0.415196 -0.589039 -0.370590 0.474786 -0.214395 -0.380743 -0.805242 0.196562 0.209775 0.218935 0.191326 0.210985 0.221026 0.206112 0.218210 0.219694 0.221856 0.219785 0.234324 0.231605 0.260501 0.221718 0.353535 0.225595 0.255733 0.250152 0.253024 0.223034 0.231350 0.224878 0.233230 0.229577
chargesum: 0.00000
title: Mulliken charges with hydrogens summed into heavy atoms:
elementType: Cl O O N N C C C C C C C C C C C C C C C C C C C C
charge: -0.084343 -0.092756 -0.321882 -0.101666 -0.177353 0.034528 0.046348 0.029427 0.045550 0.065343 0.082297 0.498433 0.147511 -0.049320 -0.172976 -0.102885 0.018575 -0.040049 0.415196 -0.338888 -0.117566 0.474786 0.008640 -0.149394 -0.117557
polarizability: 3.22917130e+02 -3.36447003e+00 2.18817376e+02 -3.56482141e+01 1.30342976e+01 2.11893396e+02
1716.lowfreq: -36.9797 -13.9517 -4.5269 -2.0045 -0.0017 -0.0014 0.0011 11.1024 12.9995
frequency: -36.8945 10.7741 12.2731 19.3437 31.7749 44.6522 51.5918 71.4287 96.5560 110.0845 135.9165 165.4462 177.8963 183.3425 211.7941 212.3472 232.4257 242.7649 244.4790 277.7703 293.3190 306.5581 350.3062 361.5309 383.2047 393.3749 418.8074 435.6845 438.8543 444.0820 452.5008 464.0362 480.1449 505.8558 519.3510 552.1617 560.2875 569.7126 625.2397 645.1376 662.8645 677.2062 691.9205 744.2882 753.2168 761.7122 779.8472 787.4941 832.5005 840.1884 845.7290 859.3878 866.1993 875.5935 888.7647 927.1165 936.6872 945.7330 958.5906 963.6004 968.8931 969.3470 982.6578 997.0989 1007.4211 1016.2070 1046.2690 1050.7739 1061.3656 1073.8142 1077.2397 1092.3249 1096.0433 1099.6386 1109.4516 1142.0452 1146.8309 1156.9233 1172.2887 1182.5121 1184.8510 1204.4997 1221.8476 1229.2852 1244.1283 1252.6494 1257.5364 1290.9223 1294.8522 1298.6060 1303.3946 1325.4662 1343.0138 1344.4526 1353.3287 1356.0958 1366.2521 1375.2030 1381.2965 1382.5093 1387.9365 1393.2904 1397.0769 1432.8688 1433.9552 1454.3150 1455.7967 1460.2492 1462.1173 1467.5087 1469.1946 1475.7551 1477.3833 1484.8419 1485.3745 1558.1671 1591.1734 1615.7404 1622.4671 2863.6681 2870.6493 2912.8513 2921.9053 2926.5468 2978.6824 2980.8204 3035.5308 3040.0759 3045.2826 3052.3722 3054.9128 3055.3458 3057.2852 3087.4984 3093.4056 3124.4965 3135.9180 3143.7802 3147.1750 3164.0069 3169.4543 3181.5890 3184.5541 3529.3558
redmass: 1.0266 6.9877 5.2859 4.1322 4.5045 3.2024 5.8167 5.9126 4.6853 4.7917 4.7773 3.6589 5.1654 5.2177 3.0266 3.4008 4.6677 2.9286 2.6849 3.6444 2.9381 2.9086 2.6695 5.2704 4.1420 2.4554 2.9571 1.9458 2.6503 2.2817 1.8454 3.3950 2.9097 4.9517 4.7109 5.3615 3.6330 4.3885 2.6856 4.2108 4.7604 1.9935 2.1138 5.2467 4.7886 1.4716 1.4581 3.4978 1.6467 3.3792 1.6246 1.4286 1.3544 2.6253 1.4654 2.5246 3.2201 2.4620 1.3603 2.1937 1.3287 5.1298 5.2173 1.9302 2.2841 2.0861 1.5534 1.7635 1.9643 2.1681 2.2289 2.0232 1.8492 1.6598 2.0699 2.5572 2.3903 1.7908 2.0647 1.0997 1.1363 1.0982 1.5176 1.4592 1.4714 1.4495 2.8531 1.4223 1.2968 1.3300 1.3827 1.3849 1.3815 1.4620 1.7012 1.4403 1.4768 1.6345 2.0013 1.6919 4.1690 1.4410 1.2729 2.0690 3.2557 1.1068 1.0839 1.1182 1.1069 1.0988 1.0512 2.1892 1.1057 1.4407 2.2824 6.3491 5.9682 6.7912 6.4932 1.0712 1.0696 1.0686 1.0687 1.0704 1.0373 1.0552 1.0870 1.0890 1.0908 1.1002 1.0967 1.0931 1.0975 1.0988 1.0894 1.0866 1.0871 1.0923 1.0933 1.0929 1.0963 1.0926 1.0954 1.0652
irintensity: 0.4733 0.3274 0.1351 0.1178 0.1848 0.5418 0.8123 0.5036 1.5259 0.1057 2.0149 10.3719 1.7009 1.6083 1.9139 0.7190 0.9853 8.9349 0.4631 1.3979 10.4393 4.2280 0.6026 5.5440 3.7625 1.2374 20.9632 28.6476 1.4687 47.9153 106.2271 5.4558 1.0395 2.5196 3.1417 3.2174 0.1690 1.4737 7.2643 3.4898 6.6730 27.6777 22.7644 6.2662 28.8113 62.6518 62.6672 5.9027 22.8615 21.3114 11.5222 0.2390 4.4862 3.7239 14.0683 33.0131 105.8455 3.0914 2.6127 50.8206 2.2158 28.4070 1.1778 14.0246 96.3150 61.6331 13.5682 11.9112 7.4287 36.2848 16.1708 23.6275 2.2525 8.3819 13.3229 62.6903 40.4877 126.5522 23.5494 3.6843 2.0103 1.0047 33.7587 46.4106 107.7075 64.4428 79.4803 22.7108 10.4999 4.6229 22.7416 7.6530 3.4677 2.1414 8.8163 1.0249 7.3248 24.6544 15.4846 58.5385 4.2198 14.9479 14.0370 44.6443 4.3602 14.2209 0.4927 70.4995 67.0755 10.3696 12.6051 13.5821 17.6292 91.3672 98.5546 88.7091 66.1144 287.7699 88.0956 48.2203 95.7210 53.6088 59.4232 127.7363 35.4386 20.9790 10.1931 23.7669 39.2936 38.2725 17.3611 56.3839 21.4763 19.7750 19.7060 4.9264 12.9117 26.9845 10.3177 18.2207 10.0908 6.1132 1.2964 20.8434
temp: 298.150 k
press: 1.00000 atm
elementType: 17 8 8 7 7 6 6 6 6 6 6 6 6 6 6 6 6 6 6 6 6 6 6 6 6 1 1 1 1 1 1 1 1 1 1 1 1 1 1 1 1 1 1 1 1 1 1 1 1 1
symmnumber: 1
zpe: 1080665.5 jmol-1
zpe.correction: 0.411604 hartree
zpe.thermalcorrener: 0.435185 hartree
zpe.thermalcorrenthalpy: 0.436129 hartree
zpe.thermalcorrgfe: 0.354203 hartree
zpe.sumelectzpe: -1495.237817 hartree
zpe.sumelectthermal: -1495.214236 hartree
zpe.sumelectthermalent: -1495.213292 hartree
zpe.sumelectthermalfe: -1495.295218 hartree
dipole: 3.0900 -1.8519 -1.4881
dipole: 3.8977
quadrupole: -175.2052 -161.5208 -148.7985
quadrupole: -10.8819 4.4109 3.9491
quadrupole: -13.3637 0.3207 13.0430 -10.8819 4.4109 3.9491
hfenergy: -1495.6494204 hartree
pointgroup: C01 [X(C20H25Cl1N2O2)]
dipole: -1.1273339 0.8087191 -0.6531777 debye
polarizability: 316.2685221|-8.7455496|220.2690157|42.756995|-15.4533108|217.0903646 unknown
InChI: InChI=1S/C20H25ClN2O2/c1-16-4-2-7-20(12-16)25-15-19(24)14-22-8-10-23(11-9-22)18-6-3-5-17(21)13-18/h2-7,12-13,19,24H,8-11,14-15H2,1H3
charge 0 multiplicity 1
50 atoms
Cl 7.319079 -0.192895 2.516392
O  -2.95408 -3.481056 -0.18805
O  -3.462984 -0.755425 -0.069523
N  0.197738 -1.402262 -0.497005
N  2.901374 -0.374186 -0.31865
C  1.313119 -2.268724 -0.051049
C  0.700453 -0.429022 -1.494734
C  2.436974 -1.437303 0.59469
C  1.795673 0.448531 -0.867049
C  -0.995138 -2.162519 -0.942543
C  -1.907468 -2.547547 0.249594
C  4.180138 0.197661 -0.128617
C  -2.525036 -1.317567 0.924959
C  5.010215 -0.195292 0.967822
C  4.705681 1.16471 -1.043093
C  6.298214 0.349875 1.094084
C  5.997185 1.695523 -0.871747
C  6.830299 1.295308 0.201527
C  -4.194342 0.394757 0.283407
C  -5.089324 0.872663 -0.705643
C  -4.069419 1.060021 1.525191
C  -5.874951 2.022031 -0.47087
C  -4.857722 2.212077 1.757355
C  -5.749652 2.69247 0.778026
C  -6.841374 2.532676 -1.526447
H  1.739461 -2.846521 -0.909776
H  0.942265 -2.997082 0.692647
H  -0.135668 0.218482 -1.815252
H  1.115098 -0.940732 -2.399523
H  2.071384 -1.010345 1.557284
H  3.277033 -2.11825 0.814762
H  2.182296 1.138348 -1.632313
H  1.338918 1.059403 -0.055638
H  -1.581585 -1.530643 -1.634947
H  -0.729816 -3.098468 -1.4859
H  -1.325363 -3.107185 1.003683
H  -1.73224 -0.584445 1.168148
H  -3.084513 -1.609203 1.834848
H  4.657003 -0.891931 1.730074
H  4.119571 1.484374 -1.909098
H  -3.656052 -2.937005 -0.633384
H  6.37442 2.42697 -1.595089
H  7.837131 1.698766 0.331308
H  -5.158582 0.330574 -1.655087
H  -3.381755 0.704263 2.297262
H  -4.767358 2.73479 2.716319
H  -6.352129 3.586762 0.975643
H  -6.766779 1.952909 -2.462211
H  -7.88786 2.467901 -1.172924
H  -6.645633 3.593961 -1.768063
