program: Gaussian 09
title: 000260212
version: EM64L-G09RevD.01
frameworkgroup: C1[X(C9H8Cl3NO2)]
method: RPBEPBE
basis: SDD
operation: Freq
keyword: #p
keyword: freq=noraman
keyword: PBEPBE/SDD
title: #p freq=noraman PBEPBE/SDD
converged: YES YES NO NO
title: Mulliken charges:
elementType: Cl Cl Cl O O N C C C C C C C C C H H H H H H H H
charge: 0.081926 0.073261 0.073894 -0.327983 -0.266073 -0.368273 0.455841 0.320606 -0.318359 -0.312769 -0.776127 -0.244608 -0.216198 0.300151 -0.605873 0.256923 0.310306 0.237521 0.237260 0.346401 0.235879 0.270556 0.235739
chargesum: 0.00000
title: Mulliken charges with hydrogens summed into heavy atoms:
elementType: Cl Cl Cl O O N C C C C C C C C C
charge: 0.081926 0.073261 0.073894 -0.327983 -0.266073 -0.021873 0.455841 0.320606 -0.061436 -0.002463 -0.776127 -0.007087 0.021062 0.300151 0.136302
polarizability: 1.75141360e+02 1.59037091e+01 1.66797485e+02 -2.41849957e-01 -4.29989023e-01 8.64837462e+01
1716.lowfreq: -11.9730 -8.3697 -5.2687 -0.0016 0.0009 0.0010 9.4429 30.1168 65.1766
frequency: 4.7860 30.0316 65.1534 75.8273 101.3973 104.1326 156.0247 162.8803 190.7885 202.4517 241.6747 246.5221 264.7395 285.9685 320.5834 348.2395 380.2661 404.2467 454.1461 530.8927 598.0919 605.5200 606.7212 656.4539 671.3904 683.4854 718.5946 751.5749 778.8141 783.3045 845.5476 889.7199 902.1972 963.7037 995.5722 1047.5342 1067.9473 1111.4553 1126.5900 1151.1911 1174.8730 1187.2303 1196.8319 1236.9505 1283.3647 1371.3638 1433.9852 1434.8482 1457.5185 1469.7008 1483.4936 1516.3686 1583.3962 1599.7354 1706.6560 2986.4658 3066.6958 3117.1957 3142.9648 3162.9102 3185.1803 3201.2959 3561.0985
redmass: 10.2276 5.5732 7.3305 6.2665 4.9578 1.1082 3.3634 9.4104 9.3691 9.4842 8.5900 13.7689 22.2440 5.8896 5.8612 8.4537 8.7944 7.6144 4.0121 3.9490 7.6560 7.0104 1.2424 4.5698 8.2957 9.3644 9.2208 2.3639 5.6483 1.7016 6.2213 1.4094 5.3106 1.3654 1.3164 2.5309 4.2335 2.4039 1.2856 1.7248 1.5278 1.4944 2.6033 2.9441 1.4495 11.0138 1.1905 2.1966 1.5489 1.8374 1.0432 1.4067 6.6810 6.3409 9.5058 1.0352 1.1027 1.0989 1.0871 1.0937 1.0952 1.0952 1.0777
irintensity: 1.1027 7.3203 0.7086 3.1132 0.3083 0.2775 1.2408 0.5125 1.5847 0.6768 0.9158 0.2587 0.9658 9.8810 0.9911 14.2726 7.9887 5.5213 0.8649 13.8210 22.2706 26.8841 33.5709 179.2781 31.7864 91.3074 92.5432 97.0985 3.1889 6.0321 102.1255 9.6424 46.2803 1.8259 1.5701 17.3510 147.1655 167.1109 0.0052 97.3813 224.1114 214.6612 102.9770 71.0332 16.3163 0.5283 35.7292 124.9266 238.6704 12.4056 16.7281 150.7923 11.6647 48.5449 268.0138 70.2946 30.2901 3.8134 5.2582 14.2988 6.2613 8.9517 43.4917
temp: 298.150 k
press: 1.00000 atm
elementType: 17 17 17 8 8 7 6 6 6 6 6 6 6 6 6 1 1 1 1 1 1 1 1
symmnumber: 1
zpe: 407246.4 jmol-1
zpe.correction: 0.155112 hartree
zpe.thermalcorrener: 0.170664 hartree
zpe.thermalcorrenthalpy: 0.171608 hartree
zpe.thermalcorrgfe: 0.108491 hartree
zpe.sumelectzpe: -1932.031208 hartree
zpe.sumelectthermal: -1932.015656 hartree
zpe.sumelectthermalent: -1932.014712 hartree
zpe.sumelectthermalfe: -1932.077829 hartree
dipole: -1.3591 0.1063 0.0855
dipole: 1.3659
quadrupole: -97.4811 -98.7209 -111.1514
quadrupole: 17.1935 -0.4300 0.1091
quadrupole: 4.9701 3.7303 -8.7003 17.1935 -0.4300 0.1091
hfenergy: -1932.1863202 hartree
pointgroup: C01 [X(C9H8Cl3N1O2)]
dipole: 0.5047468 0.1810364 -0.0352524 debye
dipolederiv: -0.6689338 -0.2045814 0.0128234 -0.2549694 -0.2735682 0.006332 0.014657 0.0057073 -0.1569889 -0.264568 0.1953511 0.2578974 0.0743486 -0.4155256 -0.2114056 0.2068778 -0.2555076 -0.6084329 -0.2746826 0.1808846 -0.2792906 0.0631184 -0.380679 0.1911021 -0.2184796 0.2321943 -0.6267239 -2.5965808 0.1794948 -0.0340455 0.055553 -0.41115 0.0010111 -0.034948 0.0042906 -0.1431561 -0.8393995 -0.1114206 -0.0079827 -0.1439931 -0.9918237 -0.0071825 -0.0159743 -0.0072863 -0.3372767 -1.1568062 0.3685267 -0.0092445 0.5888466 -0.6989137 0.0068707 -0.0120207 0.0060631 -0.4610416 -0.4205279 0.0656532 -0.0035609 -0.0974737 -0.5275709 0.0115876 0.0029583 0.0133206 -0.2157326 1.3994033 -0.1070985 0.0037334 -0.8602858 0.3486609 -0.0149651 0.0110301 -0.0102685 0.1145305 -0.0003859 -0.2169115 0.0069932 0.1155787 0.1362284 -0.008976 -0.0057361 -0.0067588 -0.1187363 -0.2810502 0.0552747 -0.0034271 0.4087677 -0.2524558 0.0042317 -0.0084658 0.0066573 -0.1414606 1.2299616 -0.0514653 0.0043283 0.2521271 1.4704197 0.0013742 -0.0077997 0.0017485 1.4362021 -0.0530602 -0.1417382 0.0037676 -0.193783 -0.2239234 0.0034634 0.0068804 0.0027569 -0.1518904 0.2113224 0.0608463 -0.0034556 -0.0183987 0.1906921 -0.0109914 0.0004035 -0.0092003 -0.126629 2.7463338 -0.2332119 0.0453409 0.010273 1.5393666 0.0095622 0.053887 0.0035513 0.2998304 0.6473766 -0.1683272 0.0059709 0.0730084 0.0155547 0.0005906 0.0107247 -0.0049502 0.2587142 0.0152128 -0.0481714 0.0017638 -0.0667875 0.101875 0.0017933 0.0023435 0.0011958 0.1457457 0.1359812 -0.0555211 0.0041872 -0.0570214 0.1078396 0.0027356 0.0047753 -0.0001639 0.1797942 -0.0663374 0.0900706 -0.0023443 0.0731857 0.0318351 0.0044165 -0.0018097 0.003969 0.1686474 0.0865097 0.0030634 -0.0001193 0.0232414 -0.1062582 0.0090129 -0.0013045 0.0082638 0.1504941 0.1725119 -0.0048699 -0.0051602 -0.0713636 0.2076056 -0.0017554 -0.0078794 0.0003821 0.3299491 -0.0680077 0.0608449 -0.0414297 0.0646588 0.0742024 0.0970938 -0.1210839 0.1028014 -0.0671546 0.123589 0.0176018 -0.000355 -0.1065731 -0.0182637 -0.0030159 -0.0007421 -0.0001328 0.1333083 -0.0778623 0.0657051 0.0436095 0.0679417 0.075852 -0.0928858 0.1217061 -0.0986337 -0.0619927 unknown
polarizability: 182.6833561|-11.5210925|159.201337|0.7729189|-1.9912243|86.5378979 unknown
InChI: InChI=1S/C9H8Cl3NO2/c1-13-8(14)15-7-5-3-2-4-6(7)9(10,11)12/h2-5,13H,1H3
charge 0 multiplicity 1
23 atoms
Cl -2.979986 -2.395648 0.082654
Cl -0.415678 -2.301041 -1.473601
Cl -0.38182 -2.1936 1.569869
O  1.025384 -0.048711 -0.039272
O  2.682008 1.685142 0.016221
N  3.190217 -0.613974 0.016217
C  -1.359321 -0.074299 -0.017465
C  -0.15647 0.706276 -0.049447
C  -2.597279 0.615102 -0.036742
C  -0.201749 2.117623 -0.097107
C  -1.292488 -1.580375 0.035173
C  -2.650245 2.022835 -0.084028
C  -1.453073 2.768645 -0.113319
C  2.360272 0.474919 0.000711
C  4.649082 -0.483537 0.051587
H  -3.525181 0.039451 -0.013653
H  0.731529 2.681842 -0.117492
H  -3.621184 2.527478 -0.097432
H  -1.484604 3.862784 -0.149464
H  2.745366 -1.533583 0.005006
H  5.068109 -0.954924 0.959064
H  4.899348 0.588866 0.062928
H  5.111063 -0.946068 -0.839506
