program: Gaussian 09
title: 000260222
version: EM64L-G09RevD.01
frameworkgroup: C1[X(C6H14Cl2N2O4S2)]
method: RPBEPBE
basis: SDD
operation: Freq
keyword: #p
keyword: freq=noraman
keyword: PBEPBE/SDD
title: #p freq=noraman PBEPBE/SDD
converged: YES YES NO NO
title: Mulliken charges:
elementType: Cl Cl S S O O O O N N C C C C C C H H H H H H H H H H H H H H
charge: -0.031410 -0.039757 0.997773 1.016859 -0.551300 -0.551116 -0.525956 -0.534732 -0.512815 -0.598520 -0.072561 -0.080360 -0.636979 -0.660289 -0.702191 -0.724752 0.305970 0.329834 0.346671 0.317602 0.301666 0.264238 0.253089 0.332753 0.287014 0.282765 0.292141 0.296542 0.291732 0.306089
chargesum: 0.00000
title: Mulliken charges with hydrogens summed into heavy atoms:
elementType: Cl Cl S S O O O O N N C C C C C C
charge: -0.031410 -0.039757 0.997773 1.016859 -0.551300 -0.551116 -0.525956 -0.534732 -0.166145 -0.280917 0.233410 0.249474 -0.071076 -0.074447 0.159729 0.169611
polarizability: 1.92830978e+02 -4.34742630e+00 1.63959876e+02 8.76628229e+00 -3.13605658e+00 1.36225510e+02
1716.lowfreq: -9.6859 -0.0020 -0.0019 0.0004 5.5172 9.6037 31.3279 32.7697 49.7094
frequency: 30.7900 32.4888 49.6403 55.5318 61.0209 75.6572 79.0073 121.6796 134.5235 142.8165 153.5876 165.3547 173.4322 188.2965 189.7906 209.2067 236.3106 242.3331 258.4064 286.0232 299.9744 319.2504 333.3615 346.5302 349.6872 395.5022 410.8821 447.6685 495.8690 527.5096 568.2877 585.9883 596.6892 681.9495 716.7252 790.7645 793.4824 797.0967 825.2608 868.4528 881.4123 902.1945 906.5489 951.5766 994.6130 999.5694 1018.3688 1023.1036 1030.0680 1045.4236 1080.8581 1097.0031 1161.0529 1183.0896 1249.0140 1263.4744 1280.7045 1294.8557 1304.7630 1318.5414 1327.7300 1333.3975 1390.2145 1395.4722 1412.5166 1413.7338 1416.0602 1429.3143 1439.8593 1457.7067 3004.5044 3020.0760 3037.8935 3041.8731 3043.0441 3058.2201 3134.0739 3144.4377 3163.0005 3186.0340 3190.5959 3196.0153 3258.9758 3356.5611
redmass: 7.4121 9.0863 6.7617 6.1327 11.1400 10.1480 7.6956 4.1239 2.5071 1.5701 5.8636 4.3363 4.1865 2.8688 3.1241 1.5825 3.7892 3.7249 4.6101 7.0019 5.3412 4.6620 7.2198 7.1234 5.8218 4.2093 7.1522 4.6699 4.4271 3.9981 6.0748 5.5142 3.1679 5.2081 4.3463 3.6550 2.7328 7.2353 4.0608 1.6036 3.4987 2.0406 2.8438 1.7035 1.2923 1.2999 1.6980 3.2611 2.0094 1.9541 1.8397 4.0094 1.3439 1.3399 1.1452 1.1939 1.2028 1.2112 1.1861 1.1464 1.1317 1.3201 1.1496 1.1562 1.0496 1.0535 1.0546 1.0514 1.0991 1.0884 1.0844 1.0263 1.0247 1.0785 1.0630 1.0581 1.1097 1.1106 1.1074 1.1077 1.1081 1.1080 1.0721 1.0750
irintensity: 0.5124 0.9476 7.4671 6.4837 3.1216 2.9522 2.9580 5.4732 0.9296 0.8425 7.8061 3.1271 4.4207 0.1287 2.4000 2.2710 4.2888 6.9167 7.0962 10.2731 8.3577 5.6043 51.2665 9.8034 36.3149 11.0059 27.9261 62.7313 11.3533 43.1266 26.5439 39.7516 9.6761 21.1952 72.8558 73.2175 70.5260 95.2077 49.8479 15.7100 102.2122 93.5654 70.3672 5.3299 19.0437 34.9956 20.0035 17.8276 60.2607 14.4813 6.2755 1.6952 8.9729 9.4922 15.8603 0.2504 2.9301 17.6278 9.0039 1.7692 2.0474 8.4351 10.7402 3.7079 14.0862 12.1988 26.9218 28.9215 9.8937 15.3261 2.7480 11.3588 0.3586 5.2255 5.3072 12.9803 2.7006 2.7842 6.1985 0.1765 0.7338 0.2413 81.7115 12.2694
temp: 298.150 k
press: 1.00000 atm
elementType: 17 17 16 16 8 8 8 8 7 7 6 6 6 6 6 6 1 1 1 1 1 1 1 1 1 1 1 1 1 1
symmnumber: 1
zpe: 561493.5 jmol-1
zpe.correction: 0.213862 hartree
zpe.thermalcorrener: 0.234960 hartree
zpe.thermalcorrenthalpy: 0.235904 hartree
zpe.thermalcorrgfe: 0.162239 hartree
zpe.sumelectzpe: -2362.023303 hartree
zpe.sumelectthermal: -2362.002205 hartree
zpe.sumelectthermalent: -2362.001261 hartree
zpe.sumelectthermalfe: -2362.074925 hartree
dipole: 3.4185 1.1137 -0.9773
dipole: 3.7258
quadrupole: -139.6684 -127.6119 -134.9620
quadrupole: 3.2439 2.0845 10.4041
quadrupole: -5.5876 6.4689 -0.8813 3.2439 2.0845 10.4041
hfenergy: -2362.2371642 hartree
pointgroup: C01 [X(C6H14Cl2N2O4S2)]
dipole: 1.3727145 -0.1541921 -0.4904797 debye
polarizability: 186.2480185|-13.5460705|170.2926926|3.7723281|-7.9435376|136.4756529 unknown
InChI: InChI=1S/C6H14Cl2N2O4S2/c1-15(11,12)9-5(3-7)6(4-8)10-16(2,13)14/h5-6,9-10H,3-4H2,1-2H3
charge 0 multiplicity 1
30 atoms
Cl 3.038271 -2.63257 -1.323173
Cl -0.365068 -3.189113 1.857277
S  1.903476 1.513758 0.214705
S  -2.675444 0.95753 -0.277229
O  1.190288 1.321642 1.680546
O  1.614798 2.866449 -0.645867
O  -3.255565 0.369325 1.127161
O  -3.633427 1.135732 -1.573867
N  1.465947 0.111908 -0.923673
N  -1.277986 -0.179708 -0.906617
C  0.945051 -1.103477 -0.245488
C  -0.570876 -0.918343 0.17588
C  1.19222 -2.299182 -1.178239
C  -1.332614 -2.194426 0.570034
C  3.770094 1.247802 0.409211
C  -1.710924 2.550621 0.101273
H  1.507853 -1.272507 0.690193
H  -0.531169 -0.253253 1.06108
H  0.713181 0.517922 -1.526946
H  -1.760133 -0.780187 -1.604771
H  0.770783 -3.224809 -0.761592
H  0.842361 -2.121378 -2.206357
H  -1.494123 -2.882457 -0.276163
H  -2.285315 -1.932248 1.053708
H  4.112452 2.036492 1.093108
H  3.903503 0.239566 0.823733
H  4.186547 1.338947 -0.601957
H  -1.205866 2.845772 -0.827386
H  -2.475943 3.270728 0.424674
H  -0.996675 2.305061 0.901839
