program: Gaussian 09
title: 000260214
version: EM64L-G09RevD.01
frameworkgroup: C1[X(C12H15Cl2NO2)]
method: RPBEPBE
basis: SDD
operation: Freq
keyword: #p
keyword: freq=noraman
keyword: PBEPBE/SDD
title: #p freq=noraman PBEPBE/SDD
converged: YES YES NO NO
title: Mulliken charges:
elementType: Cl Cl O O N C C C C C C C C C C C C H H H H H H H H H H H H H H H
charge: -0.081005 -0.079542 -0.343065 -0.264174 -0.376012 -0.034240 0.579736 0.582240 0.420570 -0.704568 -0.659923 -0.536861 -0.469502 -0.544583 0.259825 -0.779129 -0.776871 0.244336 0.327779 0.228002 0.206273 0.236794 0.214440 0.203572 0.249236 0.249224 0.301372 0.267580 0.266595 0.274893 0.268260 0.268747
chargesum: 0.00000
title: Mulliken charges with hydrogens summed into heavy atoms:
elementType: Cl Cl O O N C C C C C C C C C C C C
charge: -0.081005 -0.079542 -0.343065 -0.264174 -0.048234 0.210096 0.579736 0.582240 0.420570 -0.033500 0.007325 -0.287637 -0.168130 -0.277002 0.259825 -0.237641 -0.239863
polarizability: 2.22449118e+02 -1.72742927e+00 1.77634067e+02 -9.69716154e-01 -2.95680180e+00 1.18433047e+02
1716.lowfreq: -7.2668 -4.6698 0.0017 0.0018 0.0022 3.9782 7.2209 21.4850 23.6498
frequency: 5.3357 21.4002 23.5990 29.6485 41.8974 68.4277 81.9523 105.8636 115.5618 172.3845 214.8540 218.5050 241.6756 245.4924 253.6744 262.4773 278.9045 295.1423 374.0049 398.2276 435.3446 459.0319 485.3391 524.9184 549.1837 554.2691 568.2742 627.0020 646.8259 676.9342 684.1159 697.5306 704.9704 842.2105 869.4784 892.4556 901.4297 904.1161 906.2726 920.1453 922.0688 945.0922 958.5166 986.4819 987.0914 1032.1024 1123.4337 1125.5762 1136.9272 1146.3939 1149.1447 1177.5774 1183.9282 1199.9957 1247.0991 1249.7803 1287.3669 1308.9094 1316.3617 1351.8366 1378.4621 1393.1277 1397.4234 1448.1798 1458.2247 1460.3007 1462.3125 1463.2580 1465.7122 1469.2465 1485.0587 1487.4587 1599.3982 1615.6621 1689.6324 2979.5213 2983.8083 3023.0460 3066.4216 3067.0847 3073.8814 3084.7681 3094.7247 3098.2096 3134.2802 3147.2701 3148.7622 3157.6639 3193.8240 3558.8614
redmass: 3.9726 8.1955 7.5767 6.0483 5.1234 6.1891 4.7114 5.1953 7.9378 3.6759 3.1595 1.0303 4.8170 4.1726 1.4071 2.6174 3.6323 5.0093 2.8147 2.9048 2.8524 2.5331 5.6266 5.3434 7.8392 1.2101 5.6457 5.4773 5.7056 5.6804 7.9916 8.0734 2.1982 2.7472 2.8930 1.8719 1.7353 1.4868 1.4814 1.5786 1.2207 1.5063 2.2700 4.1487 5.0270 2.9941 1.0732 1.1222 1.9558 1.7828 2.2397 1.4999 2.1377 2.3305 1.1464 1.1437 1.2846 2.5908 2.1023 1.2459 1.2125 8.3401 1.2335 2.4551 2.1023 1.1893 1.5050 1.1892 1.2446 1.1034 1.1149 1.1179 6.1790 6.7153 10.7385 1.0376 1.0362 1.0851 1.0576 1.0576 1.0986 1.0992 1.1004 1.0998 1.0928 1.1112 1.1114 1.0928 1.0930 1.0775
irintensity: 1.9063 1.5016 0.9118 0.1716 6.5382 1.4872 1.4507 0.2784 3.7285 5.0103 0.5877 0.0263 2.4905 3.7799 1.4944 5.8167 3.2025 11.0887 1.3414 7.2846 1.5600 0.1213 0.7809 4.1111 59.4494 105.7526 41.0088 29.3493 24.9147 11.5346 12.0279 16.3907 42.3309 8.2569 39.8649 35.9811 25.0419 11.9544 8.8344 3.3786 3.7849 2.2511 0.9313 5.1405 11.7156 306.1038 1.9103 24.4769 188.0623 46.1777 127.5620 53.9235 29.4336 247.1862 17.5812 17.6879 4.3654 221.2097 32.1705 6.0810 24.1852 7.7280 46.7945 280.5945 94.7204 6.1424 14.5692 15.2338 51.5600 24.2140 69.1867 19.3087 60.2809 7.9789 268.9518 21.5187 26.3427 2.6101 19.6642 21.9616 11.3105 57.1376 18.9192 41.3944 3.8981 4.6824 6.7989 1.7473 3.1820 41.5364
temp: 298.150 k
press: 1.00000 atm
elementType: 17 17 8 8 7 6 6 6 6 6 6 6 6 6 6 6 6 1 1 1 1 1 1 1 1 1 1 1 1 1 1 1
symmnumber: 1
zpe: 653281.5 jmol-1
zpe.correction: 0.248822 hartree
zpe.thermalcorrener: 0.267469 hartree
zpe.thermalcorrenthalpy: 0.268413 hartree
zpe.thermalcorrgfe: 0.195965 hartree
zpe.sumelectzpe: -1590.343532 hartree
zpe.sumelectthermal: -1590.324885 hartree
zpe.sumelectthermalent: -1590.323941 hartree
zpe.sumelectthermalfe: -1590.396388 hartree
dipole: -4.3149 -2.2407 -2.3530
dipole: 5.4014
quadrupole: -99.7974 -119.5919 -115.6636
quadrupole: 7.3950 -18.1484 -0.3242
quadrupole: 11.8869 -7.9076 -3.9793 7.3950 -18.1484 -0.3242
hfenergy: -1590.5923538 hartree
pointgroup: C01 [X(C12H15Cl2N1O2)]
dipole: 1.753326 0.3236006 -1.1563191 debye
polarizability: 221.4629015|-6.9620558|174.0172551|0.055979|-16.2257241|123.0360763 unknown
InChI: InChI=1S/C12H15Cl2NO2/c1-8(2)15-12(16)17-11-4-9(6-13)3-10(5-11)7-14/h3-5,8,15H,6-7H2,1-2H3
charge 0 multiplicity 1
32 atoms
Cl -3.519958 -2.404925 2.181052
Cl -3.983248 3.537808 0.008933
O  1.004162 0.698406 -0.042193
O  1.88423 -1.528771 -0.057805
N  3.208622 0.370513 0.326921
C  4.503338 -0.341032 0.454351
C  -2.338753 -1.051606 -0.012046
C  -2.551881 1.247949 -0.857784
C  -0.365227 0.367502 -0.202843
C  5.443247 0.485457 1.353421
C  5.120195 -0.62866 -0.93456
C  -3.136942 0.0056 -0.509912
C  -0.941053 -0.87331 0.148001
C  -1.156298 1.422176 -0.704069
C  2.039888 -0.290671 0.067475
C  -2.95973 -2.370263 0.344047
C  -3.39584 2.365205 -1.394607
H  4.279585 -1.307671 0.942637
H  3.181328 1.390286 0.378852
H  6.40187 -0.044831 1.486103
H  5.667888 1.469117 0.897036
H  4.999534 0.65347 2.350619
H  6.050877 -1.214763 -0.826129
H  5.363181 0.312884 -1.461031
H  4.417302 -1.210393 -1.555219
H  -4.21922 -0.13429 -0.616092
H  -0.317088 -1.686936 0.522104
H  -0.675108 2.37188 -0.958972
H  -3.88376 -2.577929 -0.213741
H  -2.25759 -3.211998 0.267772
H  -4.331029 2.015034 -1.85357
H  -2.850622 3.031461 -2.07785
