program: Gaussian 09
title: 000260213
version: EM64L-G09RevD.01
frameworkgroup: C1[X(C15H19Cl2NO2)]
method: RPBEPBE
basis: SDD
operation: Freq
keyword: #p
keyword: freq=noraman
keyword: PBEPBE/SDD
title: #p freq=noraman PBEPBE/SDD
converged: YES YES NO NO
title: Mulliken charges:
elementType: Cl Cl O O N C C C C C C C C C C C C C C C H H H H H H H H H H H H H H H H H H H
charge: -0.079878 -0.081089 -0.343462 -0.266369 -0.396554 -0.048337 -0.455248 -0.422214 -0.411316 -0.398290 -0.377546 0.250044 0.416781 -0.472877 -0.547383 0.581103 0.582448 -0.535078 -0.777245 -0.779156 0.254232 0.221805 0.207274 0.198580 0.241074 0.184135 0.213551 0.207508 0.203061 0.195418 0.205630 0.329377 0.305492 0.267418 0.249406 0.268496 0.268195 0.266409 0.274605
chargesum: 0.00000
title: Mulliken charges with hydrogens summed into heavy atoms:
elementType: Cl Cl O O N C C C C C C C C C C C C C C C
charge: -0.079878 -0.081089 -0.343462 -0.266369 -0.067178 0.205895 -0.026169 0.017441 -0.013630 0.012279 0.023502 0.250044 0.416781 -0.167385 -0.279964 0.581103 0.582448 -0.285672 -0.240553 -0.238142
polarizability: 2.56911602e+02 5.79579653e-01 2.05415840e+02 -1.42882264e+00 1.93823589e+00 1.43690902e+02
1716.lowfreq: -22.5747 -2.3067 -0.0022 -0.0011 0.0009 2.0644 4.8990 18.1563 24.4360
frequency: -20.0467 17.9930 24.3814 27.3363 42.3434 47.7778 72.5937 91.4357 115.1822 119.3571 189.3434 204.2036 210.8574 242.0136 246.1485 257.4988 269.9743 295.9579 322.0673 369.1668 403.1547 436.3251 460.9026 474.5660 485.7026 525.4042 549.7842 557.7050 567.5144 620.0816 629.3372 651.3696 678.6166 690.1854 698.6994 705.6555 771.6749 795.8300 830.9673 853.5335 861.5964 883.4340 900.3765 902.7487 905.3034 910.0896 921.4990 927.8999 971.0598 986.6007 988.7760 1010.1456 1035.4392 1046.8754 1057.1931 1088.6463 1114.8296 1123.3239 1126.0259 1140.6994 1151.8207 1157.5899 1177.4137 1184.6196 1244.7083 1246.2094 1249.2478 1258.6510 1273.2558 1286.7740 1300.1328 1311.6622 1327.1777 1331.3746 1335.3283 1350.7690 1355.6350 1368.3436 1393.1999 1448.3177 1454.6029 1458.6087 1459.8630 1461.4782 1463.7749 1464.2356 1468.3402 1471.9983 1486.9029 1599.4884 1615.8379 1689.7062 2955.2759 2968.3817 2973.7370 2981.7976 2986.0649 3022.3910 3031.3700 3033.7845 3040.9517 3047.7060 3055.4746 3066.1322 3067.7617 3133.8812 3147.2066 3149.5238 3157.9896 3193.6837 3565.0322
redmass: 4.0737 6.5385 9.6373 9.9438 6.6057 5.3396 5.7538 6.0352 7.8869 3.9461 2.8979 3.4912 2.7845 4.6720 3.7726 4.9427 3.4732 5.3298 2.3097 2.4285 2.3469 2.9098 2.5343 2.1537 5.5345 5.4344 7.8410 1.2857 4.2103 3.2304 4.5723 5.2448 5.2780 6.8385 6.4643 2.2790 1.5087 3.7036 1.6365 2.8968 2.3730 1.8565 1.7058 1.7336 1.6681 1.5589 1.5486 1.5812 2.6849 4.5810 4.1763 2.8938 2.4684 1.4940 1.8371 1.7179 1.0431 1.0854 1.0971 1.7866 2.4246 1.8446 1.4948 1.9700 1.3373 1.1473 1.1440 1.2689 1.3117 1.2916 1.7276 4.1525 1.4787 1.3862 1.4315 1.4336 1.4582 1.3318 8.3756 2.3450 1.2048 1.4635 1.6522 1.1634 1.1594 1.3102 1.4061 1.0897 1.1670 6.2263 6.6722 10.4897 1.0673 1.0628 1.0630 1.0632 1.0622 1.0856 1.0944 1.0961 1.1005 1.1018 1.1009 1.0576 1.0576 1.0926 1.1113 1.1114 1.0927 1.0930 1.0772
irintensity: 0.8156 0.6921 0.7277 1.0774 6.4463 0.3265 1.3481 1.4739 3.8768 2.1390 1.8461 1.1550 1.2248 1.4875 5.3257 5.6910 1.8615 13.7552 0.7838 0.5021 5.8460 0.5488 6.4550 1.0306 0.7192 5.2526 61.7737 70.0002 57.0163 16.3005 16.8149 27.1841 7.9821 9.0312 12.5424 44.3165 1.8205 12.7339 2.6133 28.7802 10.4200 3.2621 20.4086 41.9812 41.6752 24.6654 3.9614 28.5230 36.9521 3.1463 4.5796 10.2777 169.3060 24.7072 40.5342 0.3813 6.3082 7.6546 11.6265 220.8700 129.1495 18.4690 52.0179 204.5011 16.3698 16.9253 18.2942 5.8965 16.7029 4.9198 83.0967 213.1571 1.6121 1.4627 0.1575 3.0208 2.9807 5.4320 10.5980 346.4811 12.9197 28.4863 36.8959 12.4975 9.6360 52.7598 90.6179 31.4069 79.2964 66.9009 9.8213 278.5604 30.5949 39.1587 28.5352 20.9441 21.3892 38.3322 72.5452 49.7156 31.4503 48.7859 73.4788 20.9909 20.8804 4.1522 5.1008 6.3507 1.7603 4.9055 45.7144
temp: 298.150 k
press: 1.00000 atm
elementType: 17 17 8 8 7 6 6 6 6 6 6 6 6 6 6 6 6 6 6 6 1 1 1 1 1 1 1 1 1 1 1 1 1 1 1 1 1 1 1
symmnumber: 1
zpe: 824708.0 jmol-1
zpe.correction: 0.314115 hartree
zpe.thermalcorrener: 0.333382 hartree
zpe.thermalcorrenthalpy: 0.334326 hartree
zpe.thermalcorrgfe: 0.262502 hartree
zpe.sumelectzpe: -1706.839681 hartree
zpe.sumelectthermal: -1706.820414 hartree
zpe.sumelectthermalent: -1706.819470 hartree
zpe.sumelectthermalfe: -1706.891294 hartree
dipole: -4.9678 1.7938 -2.4813
dipole: 5.8356
quadrupole: -121.8944 -139.9919 -132.6930
quadrupole: -3.0791 -19.9354 -1.4522
quadrupole: 9.6320 -8.4655 -1.1666 -3.0791 -19.9354 -1.4522
hfenergy: -1707.1537962 hartree
pointgroup: C01 [X(C15H19Cl2N1O2)]
dipole: -1.9401603 -0.2011665 -1.2109865 debye
polarizability: 256.6346551|4.6291245|182.8935356|0.9156737|-29.8637323|166.4901535 unknown
InChI: InChI=1S/C15H19Cl2NO2/c16-9-11-6-12(10-17)8-14(7-11)20-15(19)18-13-4-2-1-3-5-13/h6-8,13,18H,1-5,9-10H2
charge 0 multiplicity 1
39 atoms
Cl 4.617622 3.415848 -1.277941
Cl 4.672512 -1.395766 2.818823
O  -0.145804 0.430674 -0.13697
O  -0.858528 -1.649869 0.814088
N  -2.310077 0.155971 0.447715
C  -3.536429 -0.502657 0.960181
C  -4.551744 0.579626 1.402382
C  -4.160156 -1.454789 -0.096978
C  -5.164224 1.347088 0.203252
C  -4.762629 -0.684335 -1.294509
C  -5.790373 0.373954 -0.824956
C  -1.102939 -0.483045 0.424163
C  1.241286 0.151401 -0.222283
C  1.915175 -0.849792 0.51213
C  1.943015 1.011523 -1.092957
C  3.319041 -0.983792 0.362143
C  3.344176 0.882453 -1.238495
C  4.026871 -0.120501 -0.507493
C  4.091909 1.794643 -2.164364
C  4.04402 -2.052208 1.126655
H  -3.226018 -1.104253 1.834972
H  -4.070988 1.277385 2.11478
H  -5.366827 0.069442 1.951495
H  -4.956773 -2.040784 0.404854
H  -3.392171 -2.175656 -0.432173
H  -4.389105 1.961772 -0.30301
H  -5.924529 2.061362 0.572099
H  -5.239523 -1.39564 -1.995236
H  -3.94871 -0.183977 -1.858271
H  -6.654565 -0.140481 -0.355776
H  -6.185203 0.93764 -1.691813
H  -2.353547 1.108903 0.084473
H  1.359975 -1.517526 1.17319
H  1.388391 1.780783 -1.639751
H  5.114289 -0.220223 -0.605987
H  3.485446 2.147064 -3.010589
H  5.041677 1.367215 -2.515278
H  4.959545 -2.396392 0.625271
H  3.400909 -2.90126 1.396365
