program: Gaussian 09
title: 000260195
version: EM64L-G09RevD.01
frameworkgroup: C1[X(C8H5Cl3O2)]
method: RPBEPBE
basis: SDD
operation: Freq
keyword: #p
keyword: freq=noraman
keyword: PBEPBE/SDD
title: #p freq=noraman PBEPBE/SDD
converged: YES YES NO NO
title: Mulliken charges:
elementType: Cl Cl Cl O O C C C C C C C C H H H H H
charge: 0.059399 0.044133 0.017318 -0.295308 -0.213630 0.374184 -0.288679 -0.320702 -0.056265 -0.210616 -0.082412 0.183408 -0.495560 0.289186 0.268272 0.245413 0.234314 0.247547
chargesum: 0.00000
title: Mulliken charges with hydrogens summed into heavy atoms:
elementType: Cl Cl Cl O O C C C C C C C C
charge: 0.059399 0.044133 0.017318 -0.295308 -0.213630 0.374184 -0.288679 -0.031516 -0.056265 0.057656 -0.082412 0.183408 0.231713
polarizability: 1.83756920e+02 -2.27813848e+00 1.39148276e+02 -7.06110021e-01 4.15493276e-01 5.06715559e+01
1716.lowfreq: -0.0024 -0.0022 -0.0016 1.7649 7.2215 8.8600 22.8894 57.6582 78.3975
frequency: 22.8877 57.6569 78.3969 103.6576 129.8524 157.4312 196.1460 220.1694 237.9282 256.3068 282.4062 294.9835 330.0361 351.1844 470.4309 506.0240 522.0690 546.3842 560.2486 686.6072 715.4812 735.9124 755.5425 803.1500 834.2682 935.4893 973.8974 1027.1110 1096.6673 1114.4442 1146.7480 1153.7614 1162.4764 1236.4368 1342.1803 1356.9716 1421.1347 1429.9796 1451.0697 1463.9578 1543.2448 1578.2103 1638.2991 3006.0592 3108.6329 3151.1971 3175.2789 3198.2219
redmass: 7.2634 7.2481 13.1105 1.1380 4.0998 4.4080 25.0394 26.5268 6.7770 8.0076 9.9487 5.7940 20.6543 7.9684 8.7194 5.6875 5.7383 8.1691 7.3788 7.2323 7.3585 8.3272 5.3814 7.3551 1.4771 8.9318 1.3625 9.5803 7.1797 1.2647 1.4879 1.8179 1.9294 2.7557 4.5968 9.2355 1.3686 2.0751 1.0496 1.0513 8.5464 7.3274 10.7032 1.0295 1.1046 1.1049 1.0900 1.0961
irintensity: 1.0091 0.0192 0.0098 0.6206 1.4131 7.1668 0.2052 0.3059 1.5185 3.5083 1.6243 10.7877 0.0987 9.4936 7.0486 7.4652 4.9200 8.6720 4.2293 15.4836 10.5283 28.2700 13.2266 61.1662 31.5616 7.7269 1.4155 91.2732 120.9793 0.9310 74.3255 29.5838 85.2551 228.5304 67.7940 18.9607 51.5440 14.2459 15.0564 12.7348 2.1990 76.9807 188.5166 36.1191 23.6944 14.3212 0.2686 1.1290
temp: 298.150 k
press: 1.00000 atm
elementType: 17 17 17 8 8 6 6 6 6 6 6 6 6 1 1 1 1 1
symmnumber: 1
zpe: 290493.0 jmol-1
zpe.correction: 0.110643 hartree
zpe.thermalcorrener: 0.123604 hartree
zpe.thermalcorrenthalpy: 0.124548 hartree
zpe.thermalcorrgfe: 0.068912 hartree
zpe.sumelectzpe: -1837.523509 hartree
zpe.sumelectthermal: -1837.510548 hartree
zpe.sumelectthermalent: -1837.509604 hartree
zpe.sumelectthermalfe: -1837.565239 hartree
dipole: -2.0224 -3.5848 -0.3138
dipole: 4.1279
quadrupole: -86.2736 -92.3498 -95.9294
quadrupole: 7.6677 1.6642 -1.5960
quadrupole: 5.2440 -0.8322 -4.4118 7.6677 1.6642 -1.5960
hfenergy: -1837.6341516 hartree
pointgroup: C01 [X(C8H5Cl3O2)]
dipole: 0.7695015 -1.4036665 0.2741229 debye
dipolederiv: -0.0210102 -0.1280727 -0.0067287 -0.1180631 -0.6103443 0.0168127 -0.0041624 -0.0008188 0.0115505 -0.3498137 0.3040666 -0.0300111 0.342548 -0.3002811 0.0289607 -0.0317048 0.0243419 0.0023726 -0.7599788 -0.2390135 -0.0219521 -0.2302601 -0.132734 -0.0049419 -0.0219366 -0.0037294 -0.0193091 -1.348717 0.3455263 -0.1789975 0.6062275 -0.7168199 0.2060671 -0.3175136 0.1783885 -0.3865478 -0.8149163 -0.2171519 0.0600098 -0.0932253 -0.6810654 0.1710771 -0.0309363 0.1470387 -0.3582119 -0.7400804 -0.0348583 -0.0318203 -0.13669 -0.2361426 0.0259064 -0.0154679 0.0264497 0.0269704 0.222741 0.3974486 -0.0038409 0.1285737 0.8753465 -0.0143098 0.0414179 0.0033068 -0.0394554 0.1444824 0.0011387 0.0146803 0.2142133 0.0157422 0.0057505 -0.0395052 -0.0174442 -0.1093425 0.1974401 -0.7440923 0.0415534 -0.7569811 0.1508803 -0.0425783 0.0409538 -0.044437 -0.0192661 -0.4302622 0.0013513 -0.0153836 0.0528189 -0.0152375 -0.0029383 -0.0162036 -0.00789 -0.0997177 1.0509909 0.4500367 0.0273306 0.3787918 0.2349786 0.0018872 0.0314001 0.0078485 -0.0321923 1.9834817 -0.1122015 0.1179291 -0.3313315 1.0910263 -0.4043876 0.2750283 -0.3290507 0.3935057 0.7609686 -0.1369025 0.0682644 -0.0567698 0.2383099 0.0066253 0.0697098 -0.0035077 0.2808501 0.0942588 0.0420968 -0.0003043 0.0543197 0.048431 0.0064166 0.0081528 0.0139336 0.1596367 0.0649433 -0.0315678 -0.0025017 -0.0336871 -0.0077731 0.0079291 0.0006547 0.0067374 0.1673222 -0.0512893 0.0319948 0.008548 -0.0463556 0.1011467 0.0372713 0.0863763 0.0112596 -0.0890807 0.025275 0.042315 -0.0216696 0.1082746 -0.0551386 0.0732318 -0.0419642 0.0672371 0.0951359 -0.028514 0.0278856 -0.0251058 -0.0824039 -0.000325 -0.1187798 -0.0342991 -0.0796642 0.0157794 unknown
polarizability: 183.4807742|2.225177|138.5365078|6.4806104|-7.0121474|51.5594703 unknown
InChI: InChI=1S/C8H5Cl3O2/c1-13-8(12)4-2-3-5(9)7(11)6(4)10/h2-3H,1H3
charge 0 multiplicity 1
18 atoms
Cl -0.010249 2.683589 -0.130712
Cl -3.084215 1.868274 -0.240527
Cl -3.940683 -1.252372 -0.129106
O  2.740153 -0.909154 0.448194
O  2.589205 1.273322 -0.338343
C  0.550823 -0.080024 -0.000342
C  -0.44409 0.934809 -0.092652
C  0.127983 -1.435614 0.064149
C  -1.821624 0.589973 -0.129628
C  -1.230115 -1.785509 0.024113
C  -2.20157 -0.770446 -0.075442
C  2.022072 0.213351 0.00515
C  4.212861 -0.74497 0.463787
H  0.89343 -2.209409 0.145339
H  -1.542953 -2.831582 0.068068
H  4.585345 -0.539783 -0.553923
H  4.596403 -1.702091 0.843474
H  4.495224 0.089736 1.126697
