program: Gaussian 09
title: 000260194
version: EM64L-G09RevD.01
frameworkgroup: C1[X(C10H11ClO)]
method: RPBEPBE
basis: SDD
operation: Freq
keyword: #p
keyword: freq=noraman
keyword: PBEPBE/SDD
title: #p freq=noraman PBEPBE/SDD
converged: YES YES NO NO
title: Mulliken charges:
elementType: Cl O C C C C C C C C C C H H H H H H H H H H H
charge: -0.081319 -0.271800 0.362454 -0.355270 -0.349621 -0.372475 -0.155212 -0.223944 -0.196544 -0.255607 -0.088968 -0.657541 0.218399 0.220263 0.246264 0.249804 0.247524 0.224074 0.228053 0.228688 0.244402 0.265020 0.273353
chargesum: 0.00000
title: Mulliken charges with hydrogens summed into heavy atoms:
elementType: Cl O C C C C C C C C C C
charge: -0.081319 -0.271800 0.362454 0.083392 -0.103357 -0.122671 0.092312 0.000130 0.031509 -0.026918 0.155435 -0.119168
polarizability: 1.98773030e+02 -4.91432692e+00 1.08810724e+02 -3.73345819e+00 2.13302410e+00 6.38823570e+01
1716.lowfreq: -3.8168 -0.0015 0.0002 0.0020 2.5530 14.2390 24.6955 48.6159 52.3170
frequency: 24.6923 48.5693 52.3114 88.2902 113.6679 178.5428 226.6767 240.5979 291.6356 365.1131 412.4334 415.2274 502.7603 510.2349 573.8818 610.3813 627.6647 692.1721 758.2576 782.9679 810.6909 824.2604 889.3843 907.5410 956.5116 961.2041 979.6657 983.2691 985.7070 989.3665 1022.9895 1083.4413 1085.2504 1117.0190 1157.8562 1167.5536 1179.6433 1208.1188 1212.3276 1244.5732 1290.4354 1302.5185 1315.0701 1363.6373 1389.4664 1443.5454 1454.8675 1466.5284 1480.9742 1591.9348 1611.5430 1684.7058 2938.2554 3009.1716 3060.3699 3112.7649 3121.5428 3128.4596 3136.9246 3147.6194 3154.1937 3162.6592 3172.8128
redmass: 5.7987 6.4629 3.8922 4.1124 4.3949 3.9663 4.2812 2.9897 2.2450 4.8047 2.9698 4.5667 2.8810 3.5495 6.8990 6.4212 4.7630 2.0379 1.6658 4.5182 1.5716 1.3017 1.4470 1.6197 5.1437 1.4142 2.3514 1.3892 2.6425 1.1994 2.0629 1.5199 1.3643 3.5009 1.3816 1.0897 1.2003 1.2490 2.9648 1.1485 1.2672 1.2383 1.3306 1.4737 5.5615 2.3386 1.1256 1.2323 1.8575 6.4292 6.2850 6.3570 1.0583 1.1024 1.0569 1.0958 1.0890 1.0847 1.0888 1.1097 1.0923 1.0958 1.1007
irintensity: 0.9513 1.7621 2.4487 1.5814 3.2471 4.1150 1.0407 0.2036 3.4395 10.5270 0.3777 6.1916 11.7687 2.3122 34.3823 0.4290 40.1980 34.3211 88.9779 14.3955 10.4459 1.1967 8.7157 5.7852 65.1337 4.3363 14.4414 0.8895 41.1423 38.5954 20.7982 13.9929 1.5609 19.7518 27.8905 10.9526 57.0642 2.0487 250.6815 12.6038 1.0990 2.4543 1.4278 34.2429 26.8793 3.5508 9.0360 56.7407 62.5145 29.9608 79.9855 3.5445 31.5580 29.3684 18.3759 0.9307 16.6091 3.7907 10.4599 14.6303 35.4305 21.3513 7.0731
temp: 298.150 k
press: 1.00000 atm
elementType: 17 8 6 6 6 6 6 6 6 6 6 6 1 1 1 1 1 1 1 1 1 1 1
symmnumber: 1
zpe: 477444.3 jmol-1
zpe.correction: 0.181849 hartree
zpe.thermalcorrener: 0.193685 hartree
zpe.thermalcorrenthalpy: 0.194629 hartree
zpe.thermalcorrgfe: 0.141372 hartree
zpe.sumelectzpe: -922.028363 hartree
zpe.sumelectthermal: -922.016527 hartree
zpe.sumelectthermalent: -922.015583 hartree
zpe.sumelectthermalfe: -922.068840 hartree
dipole: 1.4113 -0.0154 0.5520
dipole: 1.5155
quadrupole: -86.7822 -72.3347 -80.1015
quadrupole: 6.7351 -3.2443 1.4005
quadrupole: -7.0427 7.4048 -0.3620 6.7351 -3.2443 1.4005
hfenergy: -922.210212 hartree
pointgroup: C01 [X(C10H11Cl1O1)]
dipole: -0.5576387 0.058994 -0.202605 debye
dipolederiv: -0.7473652 -0.1068129 -0.0949364 -0.2054826 -0.252305 -0.0803904 -0.3675954 -0.0906288 -0.2856255 -2.0665097 -0.1422426 -0.0309102 -0.0477792 -0.2918356 -0.0156711 -0.0882723 -0.0210527 -0.2877337 1.7415956 0.0274741 -0.0239237 -0.2964931 0.0595189 -0.022855 -0.2005661 -0.0186191 0.0986532 1.0099079 0.1930053 0.0564627 0.4768283 0.3475507 0.0235753 0.4871765 0.0379758 0.4083197 -0.3572517 -0.0271545 -0.0085803 0.3254685 -0.0912623 0.0622241 0.1849953 0.0656977 -0.1828572 -0.4560586 -0.003453 0.012019 -0.1822421 -0.0226455 0.0992906 -0.0990972 0.0945009 -0.13243 0.0360592 -0.050058 -0.0900775 -0.0515249 0.0949056 -0.0783774 -0.1662129 -0.0978518 -0.1309078 0.1492033 0.0623805 0.0330667 -0.0545101 0.0795103 0.1282485 -0.0367572 0.1267951 -0.0665675 0.1688937 -0.0164046 -0.0143286 0.0050967 0.0803829 0.1312157 0.0020206 0.1289693 -0.0677902 -0.043739 -0.0527179 -0.0278304 -0.0010992 -0.2100101 -0.0074332 0.0009706 -0.0052691 -0.2043613 -0.2520125 -0.0414015 -0.0314507 -0.027264 0.0471997 -0.1718096 0.0290161 -0.1083721 -0.2281813 0.8923448 0.2148542 0.1711468 0.1234846 0.2519121 0.156101 0.3815912 0.1432217 0.3723602 -0.1221289 -0.0145219 0.0850359 -0.0940076 0.0454836 -0.0132386 -0.0629388 -0.0419594 -0.1318962 -0.0142837 0.0061609 -0.0129158 -0.0736514 -0.1327329 0.0499094 -0.0693996 0.0762378 0.0178567 0.010954 -0.089233 -0.0505162 -0.1179842 0.0285449 -0.0767729 -0.0624405 -0.0785475 0.1265852 0.0784835 0.0658478 0.036513 0.0575803 0.0166761 -0.0905155 0.0332097 -0.0883223 0.1203276 0.0661041 0.0449084 0.010437 0.0974427 -0.0493477 0.0612852 0.0519679 0.057876 0.1211184 0.0391051 0.0561537 0.0340457 0.0792904 -0.0319629 -0.1091439 0.0459044 -0.1082673 0.0930275 -0.0102644 -0.0924255 -0.0512846 -0.0969697 0.0022654 -0.0879752 -0.0572679 -0.0888341 0.1059595 -0.1364034 0.0230091 0.0156276 0.0241096 0.1051674 -0.0398473 0.0158815 -0.0397174 0.150837 0.0527304 0.05671 0.0060699 0.0861635 -0.0572663 0.074365 0.0314975 0.0583626 0.1370863 0.0301707 -0.0676722 -0.0435008 0.0203959 -0.102975 -0.0043885 -0.0551843 0.0174478 0.0555385 -0.069535 -0.0464063 0.0198311 -0.0468524 0.0832256 0.0122037 0.001501 -0.0196432 -0.0893191 unknown
polarizability: 196.8281005|14.7371714|99.9692053|1.0764737|19.6146009|74.6688047 unknown
InChI: InChI=1S/C10H11ClO/c11-8-4-5-9-12-10-6-2-1-3-7-10/h1-7H,8-9H2
charge 0 multiplicity 1
23 atoms
Cl 5.915203 0.998114 0.537869
O  -0.050352 -0.451248 -0.355614
C  -1.424604 -0.189629 -0.194734
C  0.896935 0.509238 0.245897
C  -1.953161 0.949274 0.462756
C  -2.291928 -1.162412 -0.752238
C  2.279357 -0.045012 0.043452
C  -3.357017 1.102111 0.557165
C  -3.686371 -0.994156 -0.649866
C  -4.229299 0.138935 0.006185
C  3.313666 0.668897 -0.473344
C  4.688517 0.1154 -0.646664
H  0.672434 0.603576 1.330942
H  0.788258 1.506834 -0.225619
H  -1.299122 1.713093 0.894012
H  -1.854043 -2.030641 -1.254448
H  2.425263 -1.086431 0.361391
H  -3.7644 1.983532 1.065342
H  -4.352032 -1.749422 -1.082414
H  -5.314011 0.266237 0.083805
H  3.160429 1.70929 -0.791189
H  4.761524 -0.951683 -0.392335
H  5.112255 0.314405 -1.641951
