program: Gaussian 09
title: 000260192
version: EM64L-G09RevD.01
frameworkgroup: C1[X(C6Cl4N2S)]
method: RPBEPBE
basis: SDD
operation: Freq
keyword: #p
keyword: freq=noraman
keyword: PBEPBE/SDD
title: #p freq=noraman PBEPBE/SDD
converged: NO NO NO NO
title: Mulliken charges:
elementType: Cl Cl Cl Cl S N N C C C C C C
charge: 0.081098 0.081098 0.072661 0.072661 0.567421 -0.382210 -0.382210 0.302968 0.302971 -0.259050 -0.259052 -0.099179 -0.099179
chargesum: 0.00000
title: Mulliken charges with hydrogens summed into heavy atoms:
polarizability: 2.04108459e+02 1.25720801e-05 1.70447357e+02 -1.45732023e-02 -2.04788602e-03 4.65707807e+01
1716.lowfreq: -0.0027 -0.0021 0.0008 3.4645 6.1342 11.9608 63.8232 70.8724 142.2113
frequency: 63.8158 70.8388 142.2110 158.2704 182.5586 189.3823 211.7157 214.4158 304.6204 313.2473 326.6836 351.5097 368.5687 450.5274 451.7291 571.1652 606.9120 619.5777 653.4117 665.1054 713.2638 750.6980 773.4749 792.1080 949.3360 951.6653 1203.9021 1234.3476 1266.4274 1417.4283 1419.0933 1467.5254 1559.3960
redmass: 32.1792 31.3301 15.5794 15.0088 30.3736 28.4136 27.4062 34.5686 27.5468 13.8196 27.1718 28.1431 12.4686 13.7033 16.7793 15.2640 18.9560 12.1222 12.1448 14.0524 13.9048 13.1032 13.7158 12.0644 12.7891 12.5482 12.1392 12.3975 12.3907 12.2954 12.0584 12.0586 12.0162
irintensity: 0.0046 0.0000 0.5572 0.0000 0.7016 0.0134 0.5161 0.0149 0.0998 0.7641 1.5174 2.6112 0.0000 10.9514 0.2189 13.3632 12.9490 3.6596 0.0000 21.0274 37.8255 52.6548 12.5671 0.0000 3.7897 1.4125 113.5902 119.3964 9.1155 58.2272 18.0216 6.0054 20.6622
temp: 298.150 k
press: 1.00000 atm
elementType: 17 17 17 17 16 7 7 6 6 6 6 6 6
symmnumber: 1
zpe: 128089.7 jmol-1
zpe.correction: 0.048787 hartree
zpe.thermalcorrener: 0.060451 hartree
zpe.thermalcorrenthalpy: 0.061395 hartree
zpe.thermalcorrgfe: 0.009326 hartree
zpe.sumelectzpe: -2575.470548 hartree
zpe.sumelectthermal: -2575.458884 hartree
zpe.sumelectthermalent: -2575.457940 hartree
zpe.sumelectthermalfe: -2575.510009 hartree
dipole: -0.2339 0.0000 0.0008
dipole: 0.2339
quadrupole: -104.2402 -114.1630 -107.2705
quadrupole: 0.0000 -0.0035 0.0007
quadrupole: 4.3177 -5.6051 1.2874 0.0000 -0.0035 0.0007
hfenergy: -2575.5193349 hartree
pointgroup: C01 [X(C6Cl4N2S1)]
dipole: -0.0920309 -0.0000035 0.0003043 debye
dipolederiv: -0.0129338 -0.0062703 0.0000004 0.0128201 -0.6911036 -0.0000342 0.0000125 -0.0000464 0.0289579 -0.0129327 0.0063514 0.0000016 -0.0127391 -0.6911041 0.0000329 0.0000099 0.0000897 0.0289582 -0.567357 0.2197116 0.0000604 0.3325017 -0.1180345 -0.0000315 0.0000925 -0.000042 0.0224056 -0.5672914 -0.2197652 0.0000567 -0.3325554 -0.1181004 0.0000314 0.0001016 0.0000251 0.0224055 -0.1583474 -0.0000248 0.0000132 -0.0000256 0.2648148 0.0000132 0.0004538 0.0000068 0.2973922 0.0945873 0.0072516 -0.0000563 -0.3877888 -0.1377792 0.0001274 -0.0002828 -0.0000051 -0.2638306 0.0945431 -0.0072243 -0.0000311 0.3878168 -0.1377354 -0.0002129 -0.0004254 -0.0000283 -0.263831 0.0113267 0.0473571 -0.000005 -0.2343737 -0.3101624 -0.0000233 0.0001464 -0.0000987 0.1356397 0.0113041 -0.0473187 0.0000983 0.2344121 -0.3101399 0.0000768 0.0000492 0.0001311 0.1356408 -0.1083334 0.0068056 0.0000138 0.0624194 1.0745285 0.0000821 -0.0000058 0.0001421 -0.0503616 -0.108325 -0.0069476 0.0000004 -0.0625607 1.0745201 -0.000039 0.0001517 -0.0002051 -0.0503624 0.6619562 -0.5591028 -0.0000637 -0.7310983 0.0500715 0.0000543 -0.0001113 -0.0000115 -0.0215073 0.6618032 0.5591763 -0.0000888 0.7311716 0.0502245 -0.0000773 -0.0001924 0.0000422 -0.0215069 unknown
polarizability: 204.108459|0.0019858|170.4473574|-0.0145731|-0.0020487|46.5707807 unknown
InChI: InChI=1S/C6Cl4N2S/c7-1-2(8)4(10)6-5(3(1)9)11-13-12-6
charge 0 multiplicity 1
13 atoms
Cl 0.222214 -3.241836 -0.00013
Cl 0.221828 3.241847 -0.000132
Cl 3.013048 -1.59955 -0.000231
Cl 3.012858 1.599893 -0.000246
S  -3.408116 -0.000209 0.000471
N  -2.226372 -1.324431 0.000112
N  -2.226528 1.324151 -0.000182
C  -0.996571 -0.738796 0.000044
C  -0.996658 0.738662 0.000133
C  0.250897 -1.449158 0.000004
C  0.250725 1.449173 0.00006
C  1.441382 -0.726042 -0.000006
C  1.441296 0.726198 0.000003
