program: Gaussian 09
title: 000260193
version: EM64L-G09RevD.01
frameworkgroup: C1[X(C11H14O2)]
method: RPBEPBE
basis: SDD
operation: Freq
keyword: #pfreq=noraman
keyword: PBEPBE/SDD
title: #p freq=noraman PBEPBE/SDD
converged: YES YES NO NO
title: Mulliken charges:
elementType: O O C C C C C C C C C C C H H H H H H H H H H H H H H
charge: -0.268622 -0.272283 -0.356242 0.362470 -0.194509 -0.174019 -0.350194 -0.373305 -0.322650 -0.224644 -0.197342 -0.257429 -0.497061 0.221059 0.210320 0.243490 0.244006 0.205644 0.192784 0.246241 0.249658 0.221992 0.226342 0.226902 0.236346 0.201814 0.199233
chargesum: 0.00000
title: Mulliken charges with hydrogens summed into heavy atoms:
elementType: O O C C C C C C C C C C C
charge: -0.268622 -0.272283 0.075136 0.362470 0.048981 0.069986 -0.103953 -0.123647 0.075777 -0.002652 0.029000 -0.030526 0.140332
polarizability: 1.99125079e+02 2.79153061e+00 1.12093415e+02 -1.73480039e+00 6.86805891e+00 7.49785093e+01
1716.lowfreq: -5.8198 -0.0004 0.0002 0.0003 4.8792 6.2034 27.6040 33.6415 63.6635
frequency: 27.5134 33.6355 63.6635 84.4617 91.9980 129.2286 168.8642 194.1697 227.9903 230.9973 270.4219 337.5125 412.2836 416.5662 438.5017 503.5218 532.2846 586.2427 610.2881 692.3050 757.2080 764.8495 813.3888 823.7384 885.3771 888.0212 947.4926 954.0161 960.7614 981.0527 983.2664 991.8934 997.9480 1022.4976 1049.9240 1083.3597 1109.3960 1113.9960 1131.2294 1156.6348 1166.5514 1178.4911 1179.1653 1210.4551 1213.6427 1277.0682 1283.3227 1314.0187 1353.2049 1373.4413 1389.4453 1437.0712 1443.0065 1456.9435 1463.4777 1465.9560 1478.7171 1481.2281 1590.7924 1611.7402 1702.8102 2892.4358 2922.3923 2935.0954 2957.6047 2994.4093 3005.4878 3104.3418 3107.9017 3116.2982 3127.1678 3136.3706 3154.9596 3163.8280 3172.7201
redmass: 4.4260 4.4180 2.3059 3.9347 3.4699 2.4662 2.3105 3.3491 1.3400 4.0836 4.0679 3.0902 2.9619 3.3371 4.5259 2.8667 2.9245 4.7276 6.4178 2.0211 1.7057 2.7392 2.2973 1.3583 3.1493 1.5681 2.0474 3.6393 1.3761 1.3119 5.3266 1.2871 1.5630 2.0665 7.0971 1.5201 1.5184 2.4023 1.9316 1.4487 1.0881 1.1877 1.1164 1.1734 3.0136 1.2219 1.2785 1.3373 1.3449 1.4910 5.0901 1.1532 2.3538 1.0526 1.0736 1.2201 1.0685 1.8771 6.3825 6.2695 6.6902 1.0599 1.0353 1.0583 1.0980 1.1024 1.1024 1.0969 1.0958 1.0867 1.0847 1.0890 1.0925 1.0952 1.1004
irintensity: 0.4744 0.6276 9.3321 1.4109 0.9776 2.3410 7.8215 1.9727 4.1888 0.7016 0.0502 0.5478 0.4351 3.5046 4.0567 12.4617 1.5452 6.3451 0.7752 35.8796 90.2450 8.1435 11.1986 3.0546 10.3088 15.7509 51.9478 55.7249 0.1294 0.6458 2.5435 55.0840 22.2750 20.9180 107.0795 14.1777 8.0108 24.1271 5.8451 5.8241 14.6600 75.3216 0.8573 1.4672 243.7701 1.0024 0.1812 1.4875 1.1223 56.2008 31.0641 1.3906 2.7518 12.0902 15.8760 50.3677 6.1020 63.4099 28.6597 82.9946 0.4949 55.6376 109.0481 35.5923 57.5693 73.9615 30.8643 30.3756 1.3613 27.9921 3.2239 12.6310 36.7370 22.9920 5.3712
temp: 298.150 k
press: 1.00000 atm
elementType: 8 8 6 6 6 6 6 6 6 6 6 6 6 1 1 1 1 1 1 1 1 1 1 1 1 1 1
symmnumber: 1
zpe: 582163.1 jmol-1
zpe.correction: 0.221734 hartree
zpe.thermalcorrener: 0.235197 hartree
zpe.thermalcorrenthalpy: 0.236141 hartree
zpe.thermalcorrgfe: 0.179596 hartree
zpe.sumelectzpe: -576.975750 hartree
zpe.sumelectthermal: -576.962288 hartree
zpe.sumelectthermalent: -576.961343 hartree
zpe.sumelectthermalfe: -577.017888 hartree
dipole: -1.6715 -1.5411 1.5437
dipole: 2.7481
quadrupole: -59.8322 -72.5383 -81.5527
quadrupole: -0.4350 -7.2537 1.8931
quadrupole: 11.4755 -1.2305 -10.2450 -0.4350 -7.2537 1.8931
hfenergy: -577.1974846 hartree
pointgroup: C01 [X(C11H14O2)]
dipole: -0.6551182 0.2587432 0.820254 debye
polarizability: 199.1103367|-0.9840865|88.7302632|-3.5048183|-19.170031|98.3564032 unknown
InChI: InChI=1S/C11H14O2/c1-12-9-5-6-10-13-11-7-3-2-4-8-11/h2-8H,9-10H2,1H3
charge 0 multiplicity 1
27 atoms
O  0.586723 0.423091 -0.422337
O  -4.921512 -0.596378 -0.705423
C  -0.305976 -0.07475 0.64717
C  1.952016 0.102531 -0.325518
C  -1.676928 0.481949 0.381234
C  -2.807176 -0.266761 0.385167
C  2.519451 -0.70121 0.695568
C  2.77252 0.643086 -1.348124
C  -4.197133 0.287113 0.220003
C  3.911826 -0.954458 0.682632
C  4.15608 0.380784 -1.346076
C  4.736724 -0.41931 -0.33003
C  -6.317645 -0.194358 -0.863473
H  -0.319002 -1.183573 0.65263
H  0.08501 0.280053 1.626143
H  -1.721675 1.564809 0.199765
H  -2.757319 -1.354457 0.5372
H  -4.167636 1.32938 -0.168055
H  -4.729285 0.302015 1.201537
H  1.901597 -1.133476 1.488345
H  2.305885 1.257231 -2.124601
H  4.347934 -1.576867 1.472478
H  4.783874 0.801479 -2.139647
H  5.812901 -0.621422 -0.331886
H  -6.771219 -0.923181 -1.553209
H  -6.404803 0.825001 -1.297377
H  -6.861934 -0.216118 0.105979
