program: Gaussian 09
title: 000260183
version: EM64L-G09RevD.01
frameworkgroup: C1[X(C11H8ClNO2)]
method: RPBEPBE
basis: SDD
operation: Freq
keyword: #p
keyword: freq=noraman
keyword: PBEPBE/SDD
title: #p freq=noraman PBEPBE/SDD
converged: NO YES NO NO
title: Mulliken charges:
elementType: Cl O O N C C C C C C C C C C C H H H H H H H H
charge: -0.016454 -0.200954 -0.198621 -0.387502 0.337502 0.292766 0.581734 -0.131654 0.005916 -0.607860 -0.373122 -0.372685 -0.231311 -0.221320 -0.589177 0.289315 0.296649 0.316609 0.241112 0.241662 0.257804 0.211008 0.258583
chargesum: 0.00000
title: Mulliken charges with hydrogens summed into heavy atoms:
elementType: Cl O O N C C C C C C C C C C C
charge: -0.016454 -0.200954 -0.198621 -0.070893 0.337502 0.292766 0.581734 -0.131654 0.005916 -0.607860 -0.083807 -0.076036 0.009800 0.020342 0.138218
polarizability: 2.14349478e+02 -1.34602922e+01 1.89354183e+02 5.98625265e-02 -7.08937884e-02 5.71573806e+01
1716.lowfreq: -6.2767 -0.0012 -0.0010 0.0017 2.4245 8.6788 49.0743 68.2873 121.9515
frequency: 49.0424 68.2756 121.9513 126.9587 167.8580 178.6841 201.9823 207.4781 276.3783 280.6025 329.3094 360.6769 379.1709 416.0728 433.8363 438.8392 481.2413 520.4575 556.0093 644.7024 650.3467 682.8879 702.6806 731.4416 795.0022 803.7980 850.2925 860.2637 936.9629 937.8304 996.3477 1013.6788 1025.5507 1072.4917 1081.3624 1109.7438 1126.9928 1170.6786 1175.8124 1237.3201 1269.2153 1297.0177 1390.9647 1400.9417 1438.3661 1442.1230 1457.5072 1469.9371 1471.7418 1480.9251 1525.7774 1549.0908 1582.1584 1604.0501 1613.3747 2999.9758 3090.4573 3105.5746 3138.3257 3153.1797 3164.0405 3173.5084 3487.2025
redmass: 5.1518 7.8389 4.0379 2.9868 1.6959 2.4717 4.0584 9.1228 6.2927 8.1545 9.3585 8.4154 9.6534 3.9710 3.9584 5.0883 8.7542 3.1800 7.5005 6.6262 1.5259 4.1517 7.1537 2.8479 8.1350 1.7285 7.8460 2.9031 1.8618 5.2108 1.3933 1.3623 2.6176 2.6332 2.8129 1.2790 1.7860 1.2308 1.8769 2.2281 2.6389 3.1780 5.0518 9.6347 2.2175 1.5340 1.0420 1.9926 1.3794 1.1818 10.8174 9.9286 5.0657 6.4087 5.5626 1.0332 1.1012 1.1028 1.0864 1.0903 1.0946 1.1003 1.0757
irintensity: 9.3107 0.2259 0.0247 0.0990 0.9241 0.0012 2.9776 0.3516 0.0190 0.7016 1.9403 1.3450 18.2105 1.9410 0.1019 4.4903 3.0751 3.7211 8.9806 11.5421 100.4202 34.8829 0.6898 23.9470 91.8626 40.1937 0.3466 3.6769 0.2714 25.5901 4.4693 0.1482 7.5699 8.9850 0.2289 0.9623 52.1398 11.4091 6.6001 80.3910 162.8197 34.4779 149.8897 1.0199 21.8108 21.8871 14.0949 2.3967 9.3671 8.8936 82.8687 446.0710 122.7019 32.3303 116.1100 42.1116 19.4658 32.1861 4.6530 5.2313 1.2204 25.2874 61.9473
temp: 298.150 k
press: 1.00000 atm
elementType: 17 8 8 7 6 6 6 6 6 6 6 6 6 6 6 1 1 1 1 1 1 1 1
symmnumber: 1
zpe: 433685.0 jmol-1
zpe.correction: 0.165182 hartree
zpe.thermalcorrener: 0.178112 hartree
zpe.thermalcorrenthalpy: 0.179056 hartree
zpe.thermalcorrgfe: 0.125347 hartree
zpe.sumelectzpe: -1088.180194 hartree
zpe.sumelectthermal: -1088.167264 hartree
zpe.sumelectthermalent: -1088.166320 hartree
zpe.sumelectthermalfe: -1088.220029 hartree
dipole: -0.0808 3.7639 0.0418
dipole: 3.7650
quadrupole: -67.3683 -105.3952 -95.1142
quadrupole: -6.4792 -0.0345 0.0861
quadrupole: 21.9243 -16.1026 -5.8216 -6.4792 -0.0345 0.0861
hfenergy: -1088.3453761 hartree
pointgroup: C01 [X(C11H8Cl1N1O2)]
dipole: -0.2350661 -1.4525924 -0.169985 debye
dipolederiv: -0.5303694 0.4588447 0.0346977 0.354939 -0.451641 -0.0343469 0.0231313 -0.0306146 -0.0348484 -0.6834198 -0.0484893 -0.0140289 -0.2776253 -0.9631346 -0.0730965 -0.0348623 -0.0642751 -0.2907086 -0.6329835 -0.1673994 -0.0253232 -0.3384094 -0.9867039 -0.0787626 -0.0404821 -0.0709593 -0.3246427 -1.1489138 -0.7846423 -0.1002386 -0.1327444 -0.3285848 0.0035375 -0.0325478 -0.0124379 -0.3973895 -0.7353182 -0.092593 -0.0248659 -0.1369352 -0.0476024 -0.0080556 -0.0294659 -0.0074913 0.0089613 -0.0993813 0.2150349 0.0183904 0.2504633 -0.1154035 -0.0082301 0.0203952 -0.0096937 0.0239666 0.6889521 1.0986433 0.1272883 1.0131502 -0.1306677 -0.0043244 0.1197129 -0.0040977 0.1772487 1.4570751 -0.2794282 0.0004632 0.18214 1.1914427 0.1057723 0.046159 0.0946896 0.1544065 1.4039288 0.4458967 0.0757115 0.4282784 0.8464675 0.0799549 0.0703171 0.0785242 0.1865341 -0.3687117 -1.0653859 -0.1140997 -1.3376147 0.2102899 0.007649 -0.1407947 0.0130807 -0.1914676 0.004415 0.1446422 0.0167001 -0.0721112 0.0755405 0.0165057 -0.0045141 0.0210626 -0.1002595 -0.2919664 0.0081641 -0.0033301 0.1845078 0.071046 0.0220854 0.0154354 0.0184889 -0.1057004 0.0340833 -0.1813887 -0.0141846 -0.1199531 -0.0009594 0.0128657 -0.0077694 0.0112739 -0.1530754 0.2318347 0.0899783 0.0165251 -0.015147 0.0024076 0.0130512 0.0056889 0.0153355 -0.1318673 0.4104454 0.1877547 0.025192 0.1434642 0.3798943 0.0214359 0.0213289 0.0226773 0.217828 0.1088534 -0.0693951 -0.0080179 0.0038655 0.0084159 -0.0146323 -0.0012852 -0.0161046 0.1526162 0.1409693 0.0239201 0.0022443 -0.0567058 0.0159602 -0.0153491 -0.0055833 -0.01393 0.1557235 0.2419921 0.0096273 -0.0011728 -0.0746378 0.0823574 -0.0250247 -0.0103237 -0.0230204 0.3015855 -0.030868 0.09576 0.0055036 0.1105952 0.0080512 -0.0128637 0.0072482 -0.0132394 0.1593708 -0.1057525 -0.0452014 -0.0099436 -0.0511049 0.0802483 -0.0086404 -0.0107521 -0.0084161 0.1551675 0.050229 -0.0010036 0.0716604 -0.0702133 0.0071359 -0.0580958 0.0234266 -0.0789079 -0.0551324 -0.202837 -0.051225 -0.0156591 0.0809971 0.0685792 -0.0030871 -0.0028022 -0.0075919 0.1219758 0.0577433 0.0078856 -0.0635122 -0.0691986 -0.0231393 0.0616516 -0.0316607 0.0856473 -0.0302929 unknown
polarizability: 217.4610217|9.1076129|184.8002442|4.7005626|13.1453397|58.5997757 unknown
InChI: InChI=1S/C11H8ClNO2/c1-13-9-8(12)10(14)6-4-2-3-5-7(6)11(9)15/h2-5,13H,1H3
charge 0 multiplicity 1
23 atoms
Cl -2.609583 2.469707 0.118854
O  -0.850718 -2.398079 -0.320238
O  0.376269 2.954631 0.238567
N  -2.968162 -0.497564 -0.197553
C  0.853042 -0.703756 -0.120026
C  1.167034 0.675393 0.024977
C  -1.649757 -0.122782 -0.122512
C  -0.558556 -1.167153 -0.199732
C  0.084516 1.719253 0.109654
C  -1.280219 1.220331 0.025176
C  1.894571 -1.662423 -0.193313
C  2.517324 1.083721 0.093866
C  3.240426 -1.249734 -0.124015
C  3.551564 0.125234 0.019338
C  -3.548464 -1.842198 -0.357263
H  1.6256 -2.717442 -0.304926
H  2.727008 2.151832 0.205893
H  -3.627781 0.284729 -0.135289
H  4.044697 -1.990403 -0.181229
H  4.597341 0.446224 0.072896
H  -3.212196 -2.325075 -1.289695
H  -4.645196 -1.727585 -0.382021
H  -3.271257 -2.509863 0.475193
