program: Gaussian 09
title: 000260209
version: EM64L-G09RevD.01
frameworkgroup: C1[X(C13H19NO3S)]
method: RPBEPBE
basis: SDD
operation: Freq
keyword: #p
keyword: freq=noraman
keyword: PBEPBE/SDD
title: #p freq=noraman PBEPBE/SDD
converged: YES YES NO NO
title: Mulliken charges:
elementType: S O O O N C C C C C C C C C C C C C H H H H H H H H H H H H H H H H H H H
charge: 0.677386 -0.343247 -0.654174 -0.265654 -0.390201 -0.571666 -0.384706 0.410008 -0.648291 0.248949 -0.581828 0.467525 -0.355915 -0.415561 -0.817441 -0.793071 0.215932 -0.612369 0.229226 0.222831 0.295343 0.231107 0.259439 0.272109 0.235558 0.249641 0.232285 0.224498 0.224420 0.233699 0.247430 0.276623 0.274133 0.401167 0.234312 0.264943 0.205560
chargesum: 0.00000
title: Mulliken charges with hydrogens summed into heavy atoms:
elementType: S O O O N C C C C C C C C C C C C C
charge: 0.677386 -0.343247 -0.654174 -0.265654 0.010965 -0.119610 0.141744 0.410008 -0.116743 0.248949 -0.346270 0.467525 -0.106274 -0.183276 -0.134824 0.005115 0.215932 0.092447
polarizability: 2.54756732e+02 1.07160453e+01 1.63326377e+02 -8.01955585e+00 1.93012726e+01 1.30828696e+02
1716.lowfreq: -0.0016 0.0022 0.0022 4.6992 9.2325 12.7570 22.3574 31.3560 38.5424
frequency: 22.3089 31.2776 38.2507 54.2016 62.7969 67.3794 80.9337 87.3759 122.7600 139.0476 152.4090 167.9864 177.6243 182.6362 210.8057 238.1521 247.6211 268.8990 278.2639 302.5215 320.2491 329.3381 354.5692 378.6887 455.8743 463.7868 533.5359 540.1424 564.8840 582.0074 628.6923 634.6329 689.7020 723.8321 745.3591 749.0402 764.2084 782.6390 832.0287 842.9795 863.7685 892.0303 927.9176 932.0172 945.3145 957.1446 959.9031 992.5435 1018.6351 1027.6938 1048.2027 1050.8704 1056.9423 1099.2824 1121.4518 1128.8124 1145.8999 1153.0884 1186.9703 1219.9026 1235.1562 1246.9018 1256.7190 1279.9132 1302.3644 1306.2255 1313.6685 1364.0165 1373.2224 1398.3127 1409.5443 1417.5468 1420.2607 1425.8317 1438.4199 1470.7273 1472.0732 1473.6072 1477.0032 1481.5978 1484.1689 1489.5294 1552.1173 1593.6491 1621.3787 1694.5590 2970.6888 2974.4957 2974.9330 3000.4367 3013.8428 3014.8346 3032.7511 3045.8060 3053.0115 3065.5194 3083.0208 3105.6880 3106.4663 3107.3771 3130.7485 3148.4024 3152.1766 3161.5535 3168.2182
redmass: 4.9969 1.0682 3.8057 4.4289 3.5716 3.8339 1.7263 1.8223 5.0427 1.2967 3.6060 2.6019 3.1228 3.4446 2.8197 3.4786 3.6837 4.3410 3.1508 4.2815 4.6573 4.2935 5.0003 4.1191 3.3142 3.6494 5.3776 4.5663 4.9061 5.1138 4.5974 5.8300 7.3254 3.3135 2.8927 2.3516 7.2002 2.4115 1.5163 1.4446 3.6723 1.4138 1.7252 1.5541 1.3237 1.3686 1.2959 1.5927 3.4078 1.5726 1.5701 2.6941 5.1441 2.2504 1.3040 1.3910 1.5597 1.6974 1.8513 1.1901 2.0350 1.6750 2.4528 1.3890 1.3275 1.1832 1.2077 1.3399 4.2492 1.2427 1.0857 3.5331 1.0774 1.1582 1.0549 1.0978 1.0651 1.2452 1.1145 1.0658 1.1361 1.8880 1.4104 6.5669 6.9135 9.2949 1.0365 1.0518 1.0474 1.0596 1.0267 1.0555 1.0990 1.1003 1.0970 1.1039 1.0988 1.1080 1.0994 1.0920 1.0896 1.0872 1.1054 1.1057 1.0956
irintensity: 3.1756 0.3058 1.0287 0.8675 1.4319 3.0064 0.8156 2.3263 7.7644 4.9085 0.7258 9.1341 1.7813 3.5743 1.2364 3.2873 11.6161 3.5235 1.8663 8.9798 3.2521 4.5193 12.3559 1.1552 10.9417 7.1551 3.5579 4.8998 8.6373 12.2048 1.0469 10.1625 10.2855 2.9179 3.1188 1.1442 67.1335 23.8336 24.4392 10.0267 93.3891 5.3687 66.6727 84.0400 18.9813 1.3506 1.7968 1.0627 0.4738 2.4533 16.0434 1.6705 183.1599 104.0756 14.1609 94.1431 67.5780 4.9908 149.9049 3.8198 92.6007 17.3526 3.1051 2.3047 3.4334 5.7045 7.0588 25.8057 2.3448 8.9113 8.7387 2.4129 3.2357 34.1765 15.2952 35.7273 18.2339 27.9890 14.4644 14.7226 24.1309 64.8761 121.3220 4.0318 3.3143 307.8070 83.2488 32.3356 29.4099 20.6267 9.6325 21.7495 18.2224 42.5123 22.1657 7.1269 18.9126 4.2011 45.5556 25.5767 22.8724 687.8704 41.2470 4.2478 7.4880
temp: 298.150 k
press: 1.00000 atm
elementType: 16 8 8 8 7 6 6 6 6 6 6 6 6 6 6 6 6 6 1 1 1 1 1 1 1 1 1 1 1 1 1 1 1 1 1 1 1
symmnumber: 1
zpe: 782874.0 jmol-1
zpe.correction: 0.298181 hartree
zpe.thermalcorrener: 0.318873 hartree
zpe.thermalcorrenthalpy: 0.319817 hartree
zpe.thermalcorrgfe: 0.246599 hartree
zpe.sumelectzpe: -1183.834190 hartree
zpe.sumelectthermal: -1183.813498 hartree
zpe.sumelectthermalent: -1183.812553 hartree
zpe.sumelectthermalfe: -1183.885772 hartree
dipole: 3.5176 -5.5192 -2.5684
dipole: 7.0308
quadrupole: -88.2913 -112.6453 -120.7814
quadrupole: -1.9293 -12.6619 7.7553
quadrupole: 18.9480 -5.4060 -13.5421 -1.9293 -12.6619 7.7553
hfenergy: -1184.1323708 hartree
pointgroup: C01 [X(C13H19N1O3S1)]
dipole: 2.253368 -1.1829206 -1.0837021 debye
polarizability: 224.6953052|45.137185|191.6438919|-13.8993179|16.4931329|132.5726087 unknown
InChI: InChI=1S/C13H19NO3S/c1-10-6-7-12(17-13(15)14-2)11(9-10)5-4-8-18(3)16/h6-7,9,14H,4-5,8H2,1-3H3
charge 0 multiplicity 1
37 atoms
S  3.955382 0.33612 0.742359
O  -0.582103 0.85042 0.832079
O  2.929608 1.486626 1.424523
O  -1.410551 2.300166 -0.860958
N  0.69222 2.619094 0.167189
C  0.424948 -1.005243 -1.12987
C  1.602874 -1.025679 -0.10767
C  -0.927675 -1.204932 -0.462328
C  2.886814 -0.440358 -0.704356
C  -1.419139 -0.24374 0.462775
C  -1.736716 -2.33272 -0.728397
C  -2.998968 -2.522438 -0.106433
C  -2.662479 -0.4013 1.095308
C  -3.44832 -1.540827 0.810745
C  -3.848087 -3.739667 -0.432541
C  5.117147 1.376839 -0.370577
C  -0.498303 1.98787 -0.056516
C  0.992764 3.907518 -0.462756
H  0.430167 -0.02487 -1.648125
H  0.577839 -1.775948 -1.908475
H  1.299754 -0.40728 0.757236
H  1.76957 -2.05538 0.257972
H  3.547559 -1.172476 -1.199673
H  2.682189 0.415658 -1.371237
H  -1.373213 -3.085215 -1.440967
H  -3.000935 0.364874 1.799158
H  -4.419362 -1.66399 1.304304
H  -3.257266 -4.672891 -0.381296
H  -4.696743 -3.83815 0.26612
H  -4.26572 -3.674309 -1.455735
H  5.705128 0.704734 -1.014967
H  5.766405 1.942641 0.312417
H  4.477795 2.054985 -0.955219
H  1.429698 2.158492 0.747362
H  1.172905 4.686384 0.301013
H  0.135945 4.208459 -1.086697
H  1.89127 3.838531 -1.106063
