program: Gaussian 09
title: 000260184
version: EM64L-G09RevD.01
frameworkgroup: C1[X(C13H12ClNO2)]
method: RPBEPBE
basis: SDD
operation: Freq
keyword: #p
keyword: freq=noraman
keyword: PBEPBE/SDD
title: #p freq=noraman PBEPBE/SDD
converged: YES YES NO NO
title: Mulliken charges:
elementType: Cl O O N C C C C C C C C C C C C C H H H H H H H H H H H H
charge: -0.019788 -0.200371 -0.200500 -0.401624 0.586557 -0.283482 0.340753 0.290984 -0.426033 -0.138875 -0.623810 0.008161 -0.376479 -0.373582 -0.673353 -0.232264 -0.222001 0.236450 0.237389 0.319247 0.213960 0.213070 0.289101 0.296544 0.216272 0.216356 0.225508 0.240566 0.241245
chargesum: 0.00000
title: Mulliken charges with hydrogens summed into heavy atoms:
elementType: Cl O O N C C C C C C C C C C C C C
charge: -0.019788 -0.200371 -0.200500 -0.082377 0.586557 0.190358 0.340753 0.290984 0.000997 -0.138875 -0.623810 0.008161 -0.087379 -0.077038 -0.015217 0.008302 0.019244
polarizability: 2.62251435e+02 5.38083725e+00 2.01390767e+02 2.36452798e-01 1.18133724e-01 7.49237152e+01
1716.lowfreq: -26.5367 -10.8404 -6.5576 -0.0004 0.0012 0.0014 17.7456 29.6370 66.0019
frequency: 6.9923 24.0004 65.9832 79.3218 88.9272 128.5806 146.0567 177.9332 194.5123 222.0762 231.0571 263.8659 275.2551 289.3694 333.6350 370.5636 415.2792 432.1917 433.0368 448.0587 496.4623 516.3180 580.7236 636.0146 656.0703 680.7799 700.7470 728.9720 746.0915 796.2139 803.2756 843.5295 855.2081 875.9864 912.1259 934.1376 960.6053 994.5687 1012.9900 1026.1241 1055.8037 1076.9332 1082.7725 1117.4814 1140.4429 1161.4519 1172.1527 1235.0547 1235.1223 1265.5653 1281.7549 1286.5014 1301.3058 1347.8882 1388.4467 1391.4614 1400.1133 1437.9424 1455.7573 1468.2070 1470.1137 1475.8935 1478.5420 1488.2798 1524.6374 1547.3757 1577.6090 1602.2679 1610.0857 2969.9071 2982.6827 3000.4960 3017.3128 3056.8401 3079.3468 3086.7139 3137.7983 3152.6429 3163.3494 3172.9230 3460.3535
redmass: 2.9868 2.2572 8.6849 4.0996 3.5848 4.8948 3.8495 4.3376 8.9941 1.1084 3.6899 5.3474 6.5244 9.1096 11.4149 11.2494 3.9375 3.8827 4.0557 8.3866 8.3917 3.0351 7.0968 1.5391 6.5009 4.3480 7.4772 2.8081 1.0948 8.9431 1.7236 6.2471 2.9908 1.1636 1.8228 1.8169 7.1570 1.3950 1.3617 2.7489 2.8041 2.8982 2.6059 2.2450 1.5302 2.5861 1.1195 2.1126 1.2707 2.7086 1.0810 1.5516 2.2713 1.5277 3.3638 1.5328 9.6975 2.3698 1.5727 1.0689 2.5212 1.0602 1.0415 1.0863 10.7774 10.5707 5.1039 6.6759 6.4156 1.0590 1.0359 1.0591 1.1014 1.1046 1.1012 1.0995 1.0863 1.0902 1.0946 1.1003 1.0752
irintensity: 0.0398 1.2582 3.9270 0.2839 3.4602 0.0365 0.0007 0.4765 0.7787 0.0856 1.7504 0.2960 0.0017 1.1211 1.9832 18.3628 1.9532 0.1607 1.6833 8.5293 1.7390 3.1401 13.3869 89.6174 5.5492 23.5708 1.0488 26.6076 7.4052 78.4283 39.3524 2.0330 3.0146 3.7560 21.1065 0.1274 41.4150 4.0943 0.1533 7.2182 2.1592 10.3955 1.0306 41.1245 0.0118 31.3446 6.4070 83.5952 6.8445 161.4236 0.0682 10.1182 50.2884 17.7020 95.0633 85.4504 1.4227 11.4373 8.0017 18.6430 1.0360 0.3742 14.3490 21.6067 87.3997 484.5716 186.4081 52.1224 80.8105 22.7898 31.0525 16.8949 5.9163 13.4655 68.8162 41.7201 4.6228 5.6156 1.2741 26.6622 60.6597
temp: 298.150 k
press: 1.00000 atm
elementType: 17 8 8 7 6 6 6 6 6 6 6 6 6 6 6 6 6 1 1 1 1 1 1 1 1 1 1 1 1
symmnumber: 1
zpe: 578639.5 jmol-1
zpe.correction: 0.220392 hartree
zpe.thermalcorrener: 0.236345 hartree
zpe.thermalcorrenthalpy: 0.237289 hartree
zpe.thermalcorrgfe: 0.173943 hartree
zpe.sumelectzpe: -1166.630602 hartree
zpe.sumelectthermal: -1166.614649 hartree
zpe.sumelectthermalent: -1166.613705 hartree
zpe.sumelectthermalfe: -1166.677051 hartree
dipole: -2.1714 -3.5732 0.0126
dipole: 4.1812
quadrupole: -81.3877 -117.9391 -107.6927
quadrupole: -11.8094 -0.0074 -0.0454
quadrupole: 20.9521 -15.5992 -5.3529 -11.8094 -0.0074 -0.0454
hfenergy: -1166.850994 hartree
pointgroup: C01 [X(C13H12Cl1N1O2)]
dipole: -0.8485036 -1.3826921 -0.272593 debye
polarizability: 262.1653517|5.0023835|196.8522848|3.790459|23.6374741|79.5482807 unknown
InChI: InChI=1S/C13H12ClNO2/c1-2-7-15-11-10(14)12(16)8-5-3-4-6-9(8)13(11)17/h3-6,15H,2,7H2,1H3
charge 0 multiplicity 1
29 atoms
Cl -1.111569 3.137155 0.542794
O  -0.785608 -1.953577 -0.440541
O  1.894357 2.775402 0.523179
N  -2.288011 0.420879 0.002476
C  -0.917292 0.417992 0.021286
C  -3.238319 -0.692625 -0.22108
C  1.326354 -0.81892 -0.18385
C  2.014239 0.400482 0.064034
C  -4.680869 -0.154184 -0.137594
C  -0.160452 -0.869664 -0.217675
C  -0.184435 1.588917 0.258084
C  1.266468 1.686773 0.300437
C  2.059052 -2.012445 -0.403214
C  3.426269 0.416036 0.09082
C  -5.716468 -1.27729 -0.353004
C  3.468127 -1.991458 -0.375578
C  4.152065 -0.775296 -0.128119
H  -3.077097 -1.486835 0.530728
H  -3.055106 -1.157394 -1.206959
H  -2.71171 1.340205 0.175712
H  -4.824735 0.636715 -0.901221
H  -4.843312 0.316486 0.853162
H  1.50506 -2.937348 -0.591673
H  3.926722 1.369744 0.284242
H  -5.588864 -1.752342 -1.343145
H  -5.614795 -2.065559 0.415498
H  -6.745808 -0.881871 -0.297765
H  4.033553 -2.91365 -0.544877
H  5.246986 -0.758629 -0.106455
