program: Gaussian 09
title: 000260237
version: EM64L-G09RevD.01
frameworkgroup: C1[X(C20H22N4O4)]
method: RPBEPBE
basis: SDD
operation: Freq
keyword: #p
keyword: freq=noraman
keyword: PBEPBE/SDD
title: #p freq=noraman PBEPBE/SDD
converged: YES YES NO NO
title: Mulliken charges:
elementType: O O O O N N N N C C C C C C C C C C C C C C C C C C C C H H H H H H H H H H H H H H H H H H H H H H
charge: -0.206090 -0.206091 -0.205037 -0.205036 -0.039171 -0.039171 0.025891 0.025890 -0.376705 -0.376709 -0.390537 -0.390537 -0.439397 -0.439396 -0.342048 -0.342047 0.446281 0.446280 -0.343032 -0.343032 -0.357425 -0.357422 -0.377632 -0.377631 -0.354099 -0.354095 0.379545 0.379541 0.198278 0.211145 0.211147 0.198277 0.223111 0.192348 0.223110 0.192348 0.189608 0.232142 0.232141 0.189607 0.212948 0.212947 0.251237 0.251236 0.288830 0.288830 0.290956 0.290957 0.288856 0.288855
chargesum: 0.00000
title: Mulliken charges with hydrogens summed into heavy atoms:
elementType: O O O O N N N N C C C C C C C C C C C C C C C C C C C C
charge: -0.206090 -0.206091 -0.205037 -0.205036 -0.039171 -0.039171 0.025891 0.025890 0.032717 0.032715 0.024921 0.024921 -0.017647 -0.017648 -0.129101 -0.129100 0.446281 0.446280 -0.091795 -0.091796 -0.068595 -0.068593 -0.086676 -0.086675 -0.065243 -0.065239 0.379545 0.379541
polarizability: 4.16856120e+02 1.12735850e-01 2.78370612e+02 -4.43665162e-02 5.41689300e+01 1.74943079e+02
1716.lowfreq: -2.7435 -0.0004 0.0003 0.0006 1.7577 3.5361 6.9576 11.9413 18.5962
frequency: 6.9035 11.5464 18.4671 20.0914 35.7750 48.6765 52.9247 64.6442 73.6838 75.2458 83.6491 97.2073 117.6522 153.4036 161.5789 181.4405 198.4991 212.2151 222.9676 249.4211 251.5696 274.9523 277.2437 318.0539 326.6199 329.0896 370.2206 391.0610 413.9240 415.7511 433.9183 440.7456 466.6262 490.1530 496.3785 506.9185 507.5315 537.8315 542.3837 624.7793 625.2085 656.4250 656.7088 668.9217 669.9626 724.1751 741.0052 741.1433 768.9925 774.3452 796.5236 812.5414 843.6281 846.5031 850.1655 860.0000 860.1896 872.6783 881.2980 882.8054 942.4232 942.8827 971.7625 982.4323 995.5561 996.9898 999.7756 1003.5158 1004.2787 1015.0972 1015.3162 1022.8847 1073.3401 1090.5368 1090.6217 1096.7247 1105.6952 1107.8905 1107.9361 1112.1342 1151.4239 1171.8498 1175.6399 1187.4921 1208.0164 1215.3429 1217.7818 1230.9092 1231.7647 1241.9785 1284.7202 1285.3385 1293.1661 1293.7596 1302.8355 1328.3579 1334.2775 1347.7456 1350.8467 1356.5198 1359.3457 1361.7362 1373.9420 1373.9615 1410.0610 1410.5404 1417.2573 1418.1220 1449.4476 1449.8451 1462.2029 1462.3699 1463.2695 1477.9069 1479.3248 1479.5497 1586.3509 1586.4134 1604.5490 1604.9366 1624.6707 1624.8467 2913.2233 2913.6993 2925.5004 2926.0416 2964.4423 2971.5058 2980.6032 2982.3296 3006.5117 3007.6827 3011.0201 3035.1980 3048.5855 3049.5313 3136.9643 3139.1678 3162.7872 3162.7966 3180.3122 3180.9704 3185.7928 3185.8444
redmass: 9.0071 7.0081 5.1468 6.1691 7.4157 7.4114 5.9914 6.3796 5.5729 4.8824 4.5084 5.2269 2.9892 3.3299 3.8816 4.0875 3.5553 4.7578 4.6164 2.6590 4.0040 5.8539 5.5750 2.3453 3.5471 4.1003 3.3953 2.6886 2.9233 2.9596 3.5699 4.7807 2.9112 4.3022 3.6530 4.3896 4.4705 3.6174 3.2520 7.0798 7.0672 6.4374 6.0152 4.6666 4.7562 1.3796 4.1272 4.0470 5.0487 7.5657 2.0121 2.0042 4.0743 1.5796 3.7769 1.3314 1.6045 1.7810 1.5655 1.9313 2.7537 1.6494 1.5136 1.4651 1.4229 3.0901 1.4545 2.8521 2.7945 1.3535 1.3536 1.7675 2.3373 3.3233 3.2481 2.3658 2.2410 1.5973 1.3265 1.8750 1.2605 1.2779 1.2973 1.2165 1.2260 5.5083 4.9526 2.4091 2.3226 1.2810 1.2032 1.1870 1.2898 1.3217 1.2562 1.3193 1.3239 1.4030 1.5211 2.1255 3.1201 1.9030 2.3620 2.4138 6.1895 6.1314 3.1587 3.1748 1.0844 1.0904 1.1030 1.0837 1.0925 1.0976 2.5147 2.5228 8.1850 8.1936 6.1439 6.1165 7.1073 7.1383 1.0665 1.0675 1.0837 1.0844 1.0596 1.0594 1.0650 1.0639 1.0955 1.0925 1.0935 1.1008 1.1010 1.1023 1.0906 1.0903 1.0896 1.0896 1.0946 1.0946 1.0963 1.0963
irintensity: 0.3199 0.9878 1.5664 0.3996 0.0209 0.0083 2.1352 1.4439 1.1466 0.0467 1.1472 0.0041 8.6719 4.0196 0.1143 1.1736 1.0395 0.5867 20.6814 4.4252 6.3112 0.2966 1.7881 3.5093 1.9235 3.8276 0.4809 3.9961 0.0465 0.0470 1.4887 8.0447 13.6515 17.0483 4.2429 8.9817 0.8028 2.9849 2.3167 0.2301 0.0202 0.3074 0.7010 53.5991 2.3185 14.5566 3.5016 0.0712 29.3668 42.0015 3.4849 2.2074 0.3667 41.4148 2.0286 1.6971 2.1340 0.4549 74.1042 2.8363 6.1061 7.6482 51.1124 0.0469 3.0612 0.7468 0.0095 1.6190 5.2015 0.3243 0.0175 20.9337 9.3850 29.4258 19.4877 0.9572 2.5254 10.5277 20.6856 1.5865 4.0241 39.3651 69.5409 1.4945 24.2659 252.2169 473.0656 5.1812 9.0360 0.7713 6.6368 0.6892 4.0477 6.3181 2.4350 25.7527 3.2977 3.6757 2.3912 5.0334 48.0182 17.6180 103.1565 40.9479 3.3395 1.2240 70.4650 8.4932 25.2073 7.3516 7.5055 2.8448 25.3525 13.2046 0.1243 3.7808 3.1564 5.0851 16.9910 26.5686 2.8337 44.2528 14.5350 67.5280 194.7532 2.0379 0.0075 62.9691 7.0909 68.0478 33.2977 1.0999 31.6193 100.8029 81.1737 39.0570 21.3068 0.0151 1.4878 1.0474 1.4558 1.4723 1.2090 0.5387
temp: 298.150 k
press: 1.00000 atm
elementType: 8 8 8 8 7 7 7 7 6 6 6 6 6 6 6 6 6 6 6 6 6 6 6 6 6 6 6 6 1 1 1 1 1 1 1 1 1 1 1 1 1 1 1 1 1 1 1 1 1 1
symmnumber: 1
zpe: 1025640.4 jmol-1
zpe.correction: 0.390646 hartree
zpe.thermalcorrener: 0.417093 hartree
zpe.thermalcorrenthalpy: 0.418037 hartree
zpe.thermalcorrgfe: 0.327622 hartree
zpe.sumelectzpe: -1292.995686 hartree
zpe.sumelectthermal: -1292.969239 hartree
zpe.sumelectthermalent: -1292.968295 hartree
zpe.sumelectthermalfe: -1293.058710 hartree
dipole: -9.2752 -0.0076 0.0001
dipole: 9.2752
quadrupole: -188.8856 -200.7820 -161.8736
quadrupole: 0.0099 0.0096 -11.1373
quadrupole: -5.0385 -16.9350 21.9735 0.0099 0.0096 -11.1373
hfenergy: -1293.3863321 hartree
pointgroup: C01 [X(C20H22N4O4)]
dipole: -3.6491457 -0.0001901 0.0003177 debye
polarizability: 416.8562096|0.0147959|217.4073959|-0.0182251|74.3171058|235.906205 unknown
InChI: InChI=1S/C20H22N4O4/c25-23(26)19-9-5-17(6-10-19)15-21-13-3-1-2-4-14-22-16-18-7-11-20(12-8-18)24(27)28/h5-12,15-16H,1-4,13-14H2
charge 0 multiplicity 1
50 atoms
O  4.366116 -2.861242 -2.196636
O  4.366096 2.863906 2.196288
O  3.109814 -4.294276 -3.45185
O  3.109878 4.296843 3.451694
N  -2.567026 -2.626805 0.426494
N  -2.567456 2.628847 -0.425711
N  3.248836 -3.436444 -2.496341
N  3.248808 3.438994 2.496187
C  -4.834628 -0.646622 -0.42383
C  -4.834664 0.648395 0.425008
C  -4.953493 -1.942901 0.411718
C  -4.953838 1.944657 -0.410523
C  -3.71239 -2.261771 1.280969
C  -3.712926 2.263692 -1.279989
C  -1.40866 -2.061251 0.623575
C  -1.409069 2.063402 -0.622983
C  -0.222304 -2.421119 -0.186193
C  -0.222616 2.423371 0.186596
C  1.037632 -1.835013 0.114814
C  1.03732 1.837367 -0.114607
C  -0.321505 -3.353695 -1.257792
C  -0.321722 3.355947 1.258204
C  2.182676 -2.165097 -0.634686
C  2.182456 2.16755 0.634708
C  0.810127 -3.690265 -2.017701
C  0.810003 3.692614 2.017931
C  2.049572 -3.087531 -1.695152
C  2.049446 3.089979 1.695189
H  -5.691476 -0.604546 -1.126749
H  -3.921983 -0.704356 -1.050163
H  -3.921941 0.706263 1.051216
H  -5.69141 0.606195 1.128045
H  -5.120084 -2.804626 -0.262384
H  -5.835876 -1.873578 1.079278
H  -5.120428 2.806361 0.263607
H  -5.836326 1.875218 -1.077934
H  -3.485512 -1.421374 1.977216
H  -3.947612 -3.153142 1.896774
H  -3.948369 3.155047 -1.895733
H  -3.486073 1.423336 -1.976293
H  -1.244263 -1.291856 1.411744
H  -1.244735 1.294013 -1.411172
H  1.119417 -1.126139 0.947227
H  1.119031 1.128494 -0.947029
H  -1.299807 -3.797281 -1.465691
H  -1.300027 3.799456 1.466256
H  3.163779 -1.735306 -0.416199
H  3.163559 1.737838 0.416068
H  0.761302 -4.401781 -2.84609
H  0.761251 4.404132 2.846323
