program: Gaussian 09
title: 000260229
version: EM64L-G09RevD.01
frameworkgroup: C1[X(C22H28N2O2)]
method: RPBEPBE
basis: SDD
operation: Freq
keyword: #p
keyword: freq=noraman
keyword: PBEPBE/SDD
title: #p freq=noraman PBEPBE/SDD
converged: YES YES NO NO
title: Mulliken charges:
elementType: O O N N C C C C C C C C C C C C C C C C C C C C C C H H H H H H H H H H H H H H H H H H H H H H H H H H H H
charge: -0.264230 -0.260867 -0.053341 -0.054506 -0.375011 -0.374879 -0.394335 -0.395057 -0.433890 -0.433606 -0.355862 -0.355335 0.427101 0.428675 -0.390917 -0.364812 -0.340504 -0.367271 -0.344072 -0.347517 -0.371320 -0.371232 0.320549 0.321720 -0.537676 -0.536748 0.190367 0.217190 0.218158 0.190184 0.216890 0.185275 0.217852 0.184484 0.183454 0.217189 0.217394 0.182190 0.202520 0.200400 0.274239 0.277309 0.247149 0.242329 0.240877 0.250823 0.244094 0.240351 0.245425 0.222977 0.224403 0.246633 0.223733 0.221054
chargesum: 0.00000
title: Mulliken charges with hydrogens summed into heavy atoms:
elementType: O O N N C C C C C C C C C C C C C C C C C C C C C C
charge: -0.264230 -0.260867 -0.053341 -0.054506 0.032545 0.033463 0.007830 0.007279 -0.033247 -0.034022 -0.153342 -0.154935 0.427101 0.428675 -0.116678 -0.087503 -0.093355 -0.124942 -0.103195 -0.096694 -0.127226 -0.130880 0.320549 0.321720 0.155129 0.154672
polarizability: 4.05870186e+02 -1.23065532e+01 2.57176410e+02 -5.42340172e+00 -4.11023371e+01 1.80647663e+02
1716.lowfreq: -7.4264 -4.5832 -1.9552 -0.0004 -0.0002 0.0005 9.8345 14.3655 18.4216
frequency: 9.3086 14.2920 18.3312 22.4737 39.4350 51.1294 62.1982 75.1488 81.5959 92.8799 103.8081 113.9568 124.2308 158.9274 180.8952 194.6446 200.2575 210.3582 225.2068 238.9171 245.1527 251.0589 256.9296 300.2441 304.0029 325.8961 350.3490 370.1616 395.7533 404.2106 421.3831 427.7971 446.2393 452.3541 472.5865 499.5734 512.4464 534.0339 536.3955 563.9485 578.8306 629.1433 631.1352 723.0392 733.7117 735.0376 740.0079 749.3497 791.7010 814.2145 820.6620 826.1475 837.0834 844.1774 849.4181 850.9051 863.3152 872.7499 938.6326 943.2843 945.9398 958.9605 977.5914 983.1453 984.5860 985.2718 991.3183 995.5693 996.2450 1000.0081 1001.9351 1025.8383 1073.1112 1097.8592 1105.3076 1109.2929 1109.9849 1111.2539 1112.1276 1112.8921 1153.4840 1154.5098 1156.2435 1169.8494 1175.4364 1184.9141 1207.4443 1224.8740 1227.1954 1239.9714 1241.9462 1246.7590 1282.3198 1286.5123 1297.1975 1301.9407 1304.9506 1328.3883 1334.2705 1347.0203 1349.3312 1357.0234 1361.4759 1362.6270 1392.7158 1394.6039 1422.5133 1426.0674 1435.9560 1437.5716 1448.0321 1448.5345 1462.1035 1463.0399 1466.8149 1467.3422 1470.0127 1471.5012 1471.7719 1476.8240 1500.4512 1501.9522 1572.9424 1575.1633 1613.5347 1618.0450 1625.9767 1629.9721 2895.7601 2901.7210 2903.9681 2909.1836 2961.1733 2962.0463 2962.3320 2967.9741 2974.3348 2975.5281 3001.2940 3003.2035 3011.2798 3033.0778 3041.4946 3045.7183 3049.9006 3051.7611 3124.7416 3126.9234 3127.0046 3128.6043 3146.9957 3150.1642 3160.9825 3162.8202 3168.2136 3170.9799
redmass: 5.2788 5.6666 3.4548 5.1496 4.1258 3.9044 4.0083 4.2711 3.8442 4.0569 3.0553 3.7932 3.5683 2.7238 2.4017 2.0868 2.0836 3.9188 2.9054 1.8000 1.6208 2.2935 2.4754 4.4981 3.9849 2.3995 2.9099 3.3299 3.6429 2.8654 3.0356 3.1178 2.8140 4.0851 2.7307 3.0319 2.9433 2.6625 2.6471 4.2089 4.3388 6.9793 6.8267 1.5539 3.5533 3.5946 4.1046 3.4369 1.8644 1.3687 1.9341 1.2612 1.6123 3.7489 1.7124 3.0434 2.1157 2.7328 1.4232 2.4207 1.5649 1.4171 1.4735 1.4057 8.0411 8.3593 1.4792 1.4140 3.1730 2.5946 2.5565 1.7142 2.4627 2.2970 2.2562 1.4960 1.4884 1.2630 1.2727 1.7922 1.2597 1.3239 1.3289 1.2066 1.2298 1.1953 1.1972 2.3818 2.2386 2.5471 2.8864 1.3515 1.1789 1.1884 1.3155 1.3517 1.2628 1.3576 1.3683 1.3953 1.4976 1.7303 2.0693 1.7494 2.2989 2.3871 3.5801 3.8669 1.1809 1.2027 1.0841 1.0912 1.0813 1.0977 1.0505 1.0499 1.0974 1.0736 1.0719 1.0953 2.5879 2.5609 7.4260 7.5206 6.2215 6.2144 7.1360 7.0403 1.0731 1.0716 1.0780 1.0797 1.0329 1.0601 1.0329 1.0612 1.0638 1.0638 1.0907 1.0917 1.0956 1.0995 1.1005 1.1024 1.1040 1.1041 1.0903 1.0995 1.0984 1.0893 1.0876 1.0879 1.0939 1.0949 1.0959 1.0973
irintensity: 0.2334 0.1613 1.1863 0.2282 0.7381 3.1038 0.5220 0.4923 0.6194 2.0397 0.6120 8.5233 13.4387 5.4128 0.1920 0.0611 0.5738 2.3278 13.0162 2.4206 0.1664 3.9816 6.8035 1.2556 3.2109 7.6876 0.9453 10.1758 2.9016 2.0705 1.0728 0.5822 7.9163 0.5762 5.8786 16.7333 7.3287 27.4824 12.4925 19.5222 22.7741 0.7543 2.0251 3.2653 1.4397 0.2361 1.1367 11.8525 4.2276 39.0762 12.4857 6.6542 65.1172 6.2590 19.7410 13.5297 22.8686 0.1274 2.2329 7.4771 2.7080 2.0141 18.3855 8.1474 53.0606 45.4593 6.5476 0.9446 3.2734 2.3654 15.0664 14.3136 14.1566 0.9193 2.1377 11.3897 12.5854 0.3934 0.2440 0.8402 3.8890 4.8745 1.0121 56.8671 121.5933 5.4194 1.9542 74.6594 136.0071 56.7076 209.6348 7.1763 0.5371 4.0517 24.9294 18.4259 4.3894 26.4242 15.4481 5.7050 8.1049 1.9964 20.8038 0.2337 13.5343 0.4606 1.6805 35.2030 6.5165 9.3034 24.2368 5.8515 0.4409 21.0849 13.9408 13.6212 45.0885 32.9141 60.4136 11.2416 78.0287 107.2091 54.7774 2.2937 215.7416 199.4611 15.3630 15.8977 22.6364 21.1475 146.7852 135.5457 70.3349 0.4425 74.3204 66.8996 9.4279 80.1543 52.6818 41.4888 11.6592 48.5818 88.6010 87.2520 46.1033 47.6380 31.3942 30.8265 7.9952 6.5141 2.5977 0.9861 15.6254 13.3120 11.2488 7.2486
temp: 298.150 k
press: 1.00000 atm
elementType: 8 8 7 7 6 6 6 6 6 6 6 6 6 6 6 6 6 6 6 6 6 6 6 6 6 6 1 1 1 1 1 1 1 1 1 1 1 1 1 1 1 1 1 1 1 1 1 1 1 1 1 1 1 1
symmnumber: 1
zpe: 1183989.6 jmol-1
zpe.correction: 0.450958 hartree
zpe.thermalcorrener: 0.477479 hartree
zpe.thermalcorrenthalpy: 0.478424 hartree
zpe.thermalcorrgfe: 0.389617 hartree
zpe.sumelectzpe: -1113.097159 hartree
zpe.sumelectthermal: -1113.070638 hartree
zpe.sumelectthermalent: -1113.069694 hartree
zpe.sumelectthermalfe: -1113.158500 hartree
dipole: -2.7691 -2.2745 1.0606
dipole: 3.7371
quadrupole: -131.4108 -153.9411 -154.1812
quadrupole: 2.3991 -4.2143 -10.3860
quadrupole: 15.1002 -7.4301 -7.6702 2.3991 -4.2143 -10.3860
hfenergy: -1113.5481173 hartree
pointgroup: C01 [X(C22H28N2O2)]
dipole: 0.9647932 0.6153528 0.9231703 debye
polarizability: 406.5672065|4.5188721|194.4836897|4.9344402|50.7852678|242.6433629 unknown
InChI: InChI=1S/C22H28N2O2/c1-25-21-11-7-19(8-12-21)17-23-15-5-3-4-6-16-24-18-20-9-13-22(26-2)14-10-20/h7-14,17-18H,3-6,15-16H2,1-2H3
charge 0 multiplicity 1
54 atoms
O  3.802561 2.477636 2.745158
O  3.594758 -2.908461 -3.027851
N  -2.285463 2.613255 0.352301
N  -2.328836 -2.846855 -0.347483
C  -4.463847 0.354181 0.653548
C  -4.488914 -0.572777 -0.588395
C  -4.653725 1.852049 0.31752
C  -4.688994 -2.06819 -0.248121
C  -3.490221 2.479922 -0.489465
C  -3.511526 -2.711954 0.524677
C  -1.164706 2.078717 -0.053329
C  -1.186864 -2.351772 0.049299
C  0.094173 2.195431 0.708885
C  0.052254 -2.476281 -0.742003
C  0.151062 2.881919 1.950875
C  0.064919 -3.129071 -2.010313
C  1.290586 1.623422 0.192422
C  1.268889 -1.953607 -0.23631
C  1.359782 2.998997 2.663194
C  1.253933 -3.251562 -2.740757
C  2.505121 1.733982 0.890303
C  2.476365 -2.070821 -0.959397
C  2.544352 2.422773 2.129166
C  2.466997 -2.724756 -2.216907
C  3.904983 3.188072 4.023467
C  4.878126 -2.402425 -2.533312
H  -5.278013 0.044676 1.341099
H  -3.516655 0.226548 1.213741
H  -3.557086 -0.459103 -1.176455
H  -5.318762 -0.25167 -1.251483
H  -4.764341 2.433546 1.253225
H  -5.59041 1.981213 -0.262575
H  -4.832416 -2.646047 -1.181567
H  -5.611118 -2.186921 0.357036
H  -3.305914 1.897848 -1.423373
H  -3.793756 3.503575 -0.787766
H  -3.816228 -3.736014 0.820982
H  -3.300063 -2.140668 1.459875
H  -1.094109 1.511257 -1.010634
H  -1.082569 -1.814576 1.021263
H  -0.774355 3.321658 2.337424
H  -0.878217 -3.533445 -2.391582
H  1.264441 1.087104 -0.764082
H  1.275128 -1.446027 0.736335
H  1.374799 3.534051 3.617529
H  1.281291 -3.750696 -3.714302
H  3.43284 1.305079 0.49917
H  3.399636 -1.662544 -0.537352
H  4.963369 3.108286 4.311394
H  3.270447 2.715721 4.798178
H  3.626786 4.254069 3.91419
H  5.608422 -2.661888 -3.313493
H  5.160847 -2.888525 -1.579528
H  4.852143 -1.303731 -2.397118
