program: Gaussian 09
title: 000260234
version: EM64L-G09RevD.01
frameworkgroup: C1[X(C20H20Cl4N2)]
method: RPBEPBE
basis: SDD
operation: Freq
keyword: #p
keyword: freq=noraman
keyword: PBEPBE/SDD
title: #p freq=noraman PBEPBE/SDD
converged: YES YES NO NO
title: Mulliken charges:
elementType: Cl Cl Cl Cl N N C C C C C C C C C C C C C C C C C C C C H H H H H H H H H H H H H H H H H H H H
charge: -0.053177 -0.053144 -0.041389 -0.041389 -0.049628 -0.049680 -0.374031 -0.373990 -0.411044 -0.411105 -0.430575 -0.430561 -0.329102 -0.329096 0.543946 0.543976 -0.275879 -0.275982 -0.361505 -0.361501 -0.211117 -0.211041 -0.221832 -0.221918 -0.094139 -0.094114 0.192989 0.226376 0.226401 0.192982 0.216542 0.192418 0.216526 0.192417 0.190408 0.224662 0.224674 0.190417 0.226402 0.226439 0.287927 0.287929 0.290918 0.290881 0.260852 0.260856
chargesum: 0.00000
title: Mulliken charges with hydrogens summed into heavy atoms:
elementType: Cl Cl Cl Cl N N C C C C C C C C C C C C C C C C C C C C
charge: -0.053177 -0.053144 -0.041389 -0.041389 -0.049628 -0.049680 0.045334 0.045393 -0.002083 -0.002162 -0.015505 -0.015470 -0.102700 -0.102658 0.543946 0.543976 -0.275879 -0.275982 -0.073578 -0.073572 0.079801 0.079840 0.039020 0.038938 -0.094139 -0.094114
polarizability: 4.00721539e+02 1.58996338e-02 1.64321410e+02 8.70708492e-03 2.73963150e+01 2.45878676e+02
1716.lowfreq: -11.2533 -7.5851 0.0013 0.0020 0.0023 0.5291 6.5311 13.7906 18.9005
frequency: 4.7675 13.5921 18.8302 24.6310 35.2879 50.6224 63.5809 71.6381 84.9384 99.8333 125.2627 143.8189 154.4479 163.1600 171.4421 179.3266 180.6899 189.1431 202.7981 216.1728 232.0681 268.9892 271.7080 295.7963 297.6269 349.6253 353.0343 353.3464 371.2874 371.9559 405.6307 435.0702 444.7804 453.1502 458.4346 475.6373 490.8249 543.8943 546.9552 562.5806 564.5914 645.9993 646.9993 712.2946 712.7842 714.3951 718.3178 735.7452 784.8801 830.6767 839.0624 840.7121 847.4114 853.5980 859.4651 864.5497 865.3524 873.2255 930.8153 951.3657 972.9058 981.0790 993.3949 996.3258 1002.1061 1021.1787 1022.6466 1028.7793 1076.3838 1077.6025 1079.9880 1102.5539 1103.3928 1118.0156 1131.0067 1132.2824 1159.2391 1187.5460 1210.2714 1216.7360 1218.6701 1249.5042 1262.9196 1263.4383 1272.9419 1285.9729 1311.0752 1328.6304 1334.1184 1350.6153 1351.8213 1354.4601 1358.1492 1365.5349 1378.1138 1378.3982 1392.8069 1393.1149 1448.8994 1450.1337 1453.5156 1453.8981 1461.1071 1461.2580 1471.1060 1478.1547 1556.7281 1557.5553 1589.5340 1590.4922 1616.3048 1617.0727 2909.2298 2909.7450 2962.5811 2968.4918 2975.8201 2976.1022 2977.5005 2978.5110 3003.0820 3003.3563 3011.9804 3031.4774 3044.1709 3048.8042 3154.9512 3155.0066 3179.7129 3179.7715 3182.7430 3182.9177
redmass: 8.6905 10.2037 11.0173 14.1234 19.2349 6.8114 5.4282 6.0412 4.7917 5.0375 3.0891 2.9370 3.5933 5.4550 5.6641 14.3493 13.7367 4.3694 3.6837 3.3996 3.3688 3.4370 5.2919 3.9175 4.4809 3.1375 3.8198 3.3002 9.1574 8.8470 3.3095 3.8151 4.1458 3.5092 3.3208 4.2748 3.0561 4.6062 4.4063 3.7075 3.4812 6.9415 6.9659 3.0506 3.6928 3.0350 5.8173 2.0714 1.6975 2.8396 1.3800 1.5660 3.9282 2.0658 2.2818 1.4201 1.4042 2.5118 1.6799 2.9020 1.4493 1.4073 1.4141 1.4691 2.9945 3.3981 3.7546 1.7526 2.2060 2.3734 2.5721 2.6225 2.3330 2.1694 1.4175 1.4359 1.3476 1.1889 1.2131 1.7455 1.7100 1.2832 1.6242 1.6026 1.1651 1.1887 1.2319 1.4922 1.6359 1.7071 1.3905 1.9274 2.0609 1.5142 2.1607 2.1131 2.9738 2.8377 1.1051 1.2010 2.1998 2.4528 1.1343 1.1135 1.0762 1.0933 8.6107 8.6434 7.1744 7.1852 7.1343 7.1567 1.0651 1.0652 1.0607 1.0610 1.0865 1.0853 1.0654 1.0640 1.0923 1.0919 1.0961 1.0998 1.1011 1.1025 1.0892 1.0892 1.0957 1.0957 1.0944 1.0944
irintensity: 0.0049 0.0278 0.0005 0.1221 0.0000 0.0086 0.1161 0.6522 1.8467 0.5448 10.9801 10.2018 0.0537 0.6265 0.1640 0.5601 0.8657 0.5061 1.6656 0.3217 20.6403 0.1883 0.1060 1.3268 8.3329 0.0596 6.6094 1.4196 1.6917 3.9038 5.0461 18.1740 2.1886 34.2307 1.3226 0.2372 11.9571 12.9710 8.9595 5.6397 3.3955 1.3526 0.1750 1.0628 3.8082 2.0040 51.6078 20.2112 16.8220 28.1096 63.0467 15.9323 6.8669 1.8447 18.3582 43.3518 4.5316 3.9893 6.0495 1.9075 18.1855 0.2065 17.3465 0.0167 2.6005 28.5665 33.4244 12.4272 1.3912 61.3444 3.3009 0.3377 3.5927 1.8972 0.1426 15.3619 0.4856 0.0548 0.7268 2.8594 7.0034 0.3411 1.3544 33.0116 3.3238 4.4884 3.5705 18.3892 22.3097 0.7255 0.1175 9.2644 15.4931 2.0791 10.3163 14.4585 0.0714 32.6871 43.2858 0.6673 54.0091 64.0322 16.4797 15.2017 10.3643 6.3573 2.8620 45.7126 18.4821 139.7838 17.4355 51.2118 53.5913 79.9254 0.3814 62.8974 22.1821 31.9118 28.2882 80.6432 58.1461 8.9961 13.7988 47.2732 67.7476 86.9303 0.6710 0.5779 0.7072 2.4839 0.5666 1.2437
temp: 298.150 k
press: 1.00000 atm
elementType: 17 17 17 17 7 7 6 6 6 6 6 6 6 6 6 6 6 6 6 6 6 6 6 6 6 6 1 1 1 1 1 1 1 1 1 1 1 1 1 1 1 1 1 1 1 1
symmnumber: 1
zpe: 917978.7 jmol-1
zpe.correction: 0.349640 hartree
zpe.thermalcorrener: 0.375954 hartree
zpe.thermalcorrenthalpy: 0.376899 hartree
zpe.thermalcorrgfe: 0.287620 hartree
zpe.sumelectzpe: -2721.946057 hartree
zpe.sumelectthermal: -2721.919742 hartree
zpe.sumelectthermalent: -2721.918798 hartree
zpe.sumelectthermalfe: -2722.008077 hartree
dipole: -3.6343 -0.0009 0.0001
dipole: 3.6343
quadrupole: -173.5259 -184.0018 -178.0942
quadrupole: 0.0062 0.0003 1.3216
quadrupole: 5.0147 -5.4612 0.4464 0.0062 0.0003 1.3216
hfenergy: -2722.2956964 hartree
pointgroup: C01 [X(C20H20Cl4N2)]
dipole: -1.4297971 -0.0001892 -0.0091041 debye
polarizability: 400.7156716|-0.0113944|158.1162083|0.9319177|14.3519326|252.0897448 unknown
InChI: InChI=1S/C20H20Cl4N2/c21-17-7-5-15(19(23)11-17)13-25-9-3-1-2-4-10-26-14-16-6-8-18(22)12-20(16)24/h5-8,11-14H,1-4,9-10H2
charge 0 multiplicity 1
46 atoms
Cl 1.006101 -1.756531 2.636696
Cl 1.039576 1.762211 -2.612224
Cl 4.647287 -1.688916 -1.522544
Cl 4.625889 1.692642 1.594008
N  -2.109347 -2.536836 -0.476585
N  -2.117221 2.536266 0.461191
C  -4.224571 -0.296455 -0.737644
C  -4.233552 0.294386 0.694943
C  -4.478034 -1.821792 -0.793404
C  -4.489054 1.819466 0.747873
C  -3.486979 -2.673435 0.035344
C  -3.488347 2.672257 -0.067996
C  -1.153405 -2.274634 0.37268
C  -1.150113 2.276444 -0.376064
C  0.254497 -2.149894 -0.064606
C  0.252125 2.152455 0.079366
C  1.321345 -1.912124 0.839428
C  1.330908 1.916384 -0.810845
C  0.590733 -2.265814 -1.444178
C  0.570207 2.266991 1.46337
C  2.659598 -1.779093 0.423112
C  2.663613 1.783732 -0.377022
C  1.914306 -2.139536 -1.900018
C  1.887746 2.141056 1.936511
C  2.930551 -1.892507 -0.95303
C  2.916474 1.895787 1.002653
H  -5.00938 0.202953 -1.342573
H  -3.258239 -0.075008 -1.232008
H  -3.273057 0.073907 1.201004
H  -5.02514 -0.20584 1.290286
H  -4.432823 -2.16265 -1.84574
H  -5.500013 -2.039767 -0.421492
H  -4.457283 2.160017 1.800801
H  -5.506487 2.036763 0.363324
H  -3.570612 -2.423278 1.118651
H  -3.773363 -3.738128 -0.083483
H  -3.776997 3.736669 0.047899
H  -3.558154 2.422761 -1.152428
H  -1.342463 -2.136437 1.456928
H  -1.325049 2.13977 -1.462892
H  -0.233415 -2.453231 -2.139818
H  -0.26319 2.452906 2.148321
H  3.456812 -1.583194 1.143863
H  3.470324 1.589068 -1.087433
H  2.154582 -2.22232 -2.963061
H  2.113917 2.222732 3.002738
